swc_node_bundler 0.58.18

Speedy web compiler
Documentation
Build #951569 2023-10-27T18:24:29.965675+00:00
# rustc version
rustc 1.75.0-nightly (aa1a71e9e 2023-10-26)# docs.rs version
docsrs 0.6.0 (45c814ae 2023-10-19)# build log
[INFO] running `Command { std: "docker" "create" "-v" "/home/cratesfyi/workspace-builder/builds/swc_node_bundler-0.58.18/target:/opt/rustwide/target:rw,Z" "-v" "/home/cratesfyi/workspace-builder/builds/swc_node_bundler-0.58.18/source:/opt/rustwide/workdir:ro,Z" "-v" "/home/cratesfyi/workspace-builder/cargo-home:/opt/rustwide/cargo-home:ro,Z" "-v" "/home/cratesfyi/workspace-builder/rustup-home:/opt/rustwide/rustup-home:ro,Z" "-e" "SOURCE_DIR=/opt/rustwide/workdir" "-e" "CARGO_TARGET_DIR=/opt/rustwide/target" "-e" "DOCS_RS=1" "-e" "CARGO_HOME=/opt/rustwide/cargo-home" "-e" "RUSTUP_HOME=/opt/rustwide/rustup-home" "-w" "/opt/rustwide/workdir" "-m" "6442450944" "--cpus" "6" "--user" "1001:1001" "--network" "none" "ghcr.io/rust-lang/crates-build-env/linux@sha256:023092b8bfa974c7f3e45c5ce651cc8dd3afd5e76915d5995b8dacd3032bf956" "/opt/rustwide/cargo-home/bin/cargo" "+nightly" "rustdoc" "--lib" "-Zrustdoc-map" "-Z" "unstable-options" "--config" "build.rustdocflags=[\"-Z\", \"unstable-options\", \"--emit=invocation-specific\", \"--resource-suffix\", \"-20231026-1.75.0-nightly-aa1a71e9e\", \"--static-root-path\", \"/-/rustdoc.static/\", \"--cap-lints\", \"warn\", \"--extern-html-root-takes-precedence\"]" "--offline" "-Zunstable-options" "--config=doc.extern-map.registries.crates-io=\"https://docs.rs/{pkg_name}/{version}/x86_64-unknown-linux-gnu\"" "-Zrustdoc-scrape-examples" "-j6" "--target" "x86_64-unknown-linux-gnu", kill_on_drop: false }`
[INFO] [stderr] WARNING: Your kernel does not support swap limit capabilities or the cgroup is not mounted. Memory limited without swap.
[INFO] [stdout] 3824c37547874f370248dd290e91a28c282c8706f96eb651a6e4985db344c813
[INFO] running `Command { std: "docker" "start" "-a" "3824c37547874f370248dd290e91a28c282c8706f96eb651a6e4985db344c813", kill_on_drop: false }`
[INFO] [stderr] warning: Target filter specified, but no targets matched. This is a no-op
[INFO] [stderr]     Checking swc_ecma_minifier v0.189.17
[INFO] [stderr] error[E0407]: method `report_assign` is not a member of trait `Storage`
[INFO] [stderr]    --> /opt/rustwide/cargo-home/registry/src/index.crates.io-6f17d22bba15001f/swc_ecma_minifier-0.189.17/src/program_data.rs:354:5
[INFO] [stderr]     |
[INFO] [stderr] 354 |       fn report_assign(&mut self, ctx: Ctx, i: Id, is_op: bool) {
[INFO] [stderr]     |       ^  ------------- help: there is an associated function with a similar name: `report_usage`
[INFO] [stderr]     |  _____|
[INFO] [stderr]     | |
[INFO] [stderr] 355 | |         let e = self.vars.entry(i.clone()).or_default();
[INFO] [stderr] 356 | |
[INFO] [stderr] 357 | |         let inited = self.initialized_vars.contains(&i);
[INFO] [stderr] ...   |
[INFO] [stderr] 401 | |         }
[INFO] [stderr] 402 | |     }
[INFO] [stderr]     | |_____^ not a member of trait `Storage`
[INFO] [stderr] 
[INFO] [stderr] error[E0050]: method `report_usage` has 3 parameters but the declaration in trait `report_usage` has 4
[INFO] [stderr]    --> /opt/rustwide/cargo-home/registry/src/index.crates.io-6f17d22bba15001f/swc_ecma_minifier-0.189.17/src/program_data.rs:332:21
[INFO] [stderr]     |
[INFO] [stderr] 332 |     fn report_usage(&mut self, ctx: Ctx, i: Id) {
[INFO] [stderr]     |                     ^^^^^^^^^^^^^^^^^^^^^^^^^^ expected 4 parameters, found 3
[INFO] [stderr]     |
[INFO] [stderr]     = note: `report_usage` from trait: `fn(&mut Self, swc_ecma_usage_analyzer::analyzer::Ctx, &swc_ecma_ast::Ident, bool)`
[INFO] [stderr] 
[INFO] [stderr] error[E0050]: method `mark_property_mutation` has 2 parameters but the declaration in trait `mark_property_mutation` has 3
[INFO] [stderr]    --> /opt/rustwide/cargo-home/registry/src/index.crates.io-6f17d22bba15001f/swc_ecma_minifier-0.189.17/src/program_data.rs:463:31
[INFO] [stderr]     |
[INFO] [stderr] 463 |     fn mark_property_mutation(&mut self, id: Id) {
[INFO] [stderr]     |                               ^^^^^^^^^^^^^^^^^ expected 3 parameters, found 2
[INFO] [stderr]     |
[INFO] [stderr]     = note: `mark_property_mutation` from trait: `fn(&mut Self, (Atom, SyntaxContext), swc_ecma_usage_analyzer::analyzer::Ctx)`
[INFO] [stderr] 
[INFO] [stderr] Some errors have detailed explanations: E0050, E0407.
[INFO] [stderr] For more information about an error, try `rustc --explain E0050`.
[INFO] [stderr] error: could not compile `swc_ecma_minifier` (lib) due to 3 previous errors
[INFO] running `Command { std: "docker" "inspect" "3824c37547874f370248dd290e91a28c282c8706f96eb651a6e4985db344c813", kill_on_drop: false }`
[INFO] running `Command { std: "docker" "rm" "-f" "3824c37547874f370248dd290e91a28c282c8706f96eb651a6e4985db344c813", kill_on_drop: false }`
[INFO] [stdout] 3824c37547874f370248dd290e91a28c282c8706f96eb651a6e4985db344c813