zstd 0.13.3

Binding for the zstd compression library.
Build #1786350 2025-02-20T21:43:56.902178+00:00
# rustc version
rustc 1.87.0-nightly (f280acf4c 2025-02-19)# docs.rs version
docsrs 0.6.0 (35977596 2025-02-09)# build log
[INFO] running `Command { std: "docker" "create" "-v" "/home/cratesfyi/workspace/builds/zstd-0.13.3/target:/opt/rustwide/target:rw,Z" "-v" "/home/cratesfyi/workspace/builds/zstd-0.13.3/source:/opt/rustwide/workdir:ro,Z" "-v" "/home/cratesfyi/workspace/cargo-home:/opt/rustwide/cargo-home:ro,Z" "-v" "/home/cratesfyi/workspace/rustup-home:/opt/rustwide/rustup-home:ro,Z" "-e" "SOURCE_DIR=/opt/rustwide/workdir" "-e" "CARGO_TARGET_DIR=/opt/rustwide/target" "-e" "DOCS_RS=1" "-e" "CARGO_HOME=/opt/rustwide/cargo-home" "-e" "RUSTUP_HOME=/opt/rustwide/rustup-home" "-w" "/opt/rustwide/workdir" "-m" "6442450944" "--cpus" "6" "--user" "1001:1001" "--network" "none" "ghcr.io/rust-lang/crates-build-env/linux@sha256:3959728d45483eb673ba100a951a6b9f5012970368db2a9e08e0ac9b67c8a5ad" "/opt/rustwide/cargo-home/bin/cargo" "+nightly" "rustdoc" "--lib" "-Zrustdoc-map" "--features" "experimental zstdmt zdict_builder doc-cfg" "--config" "build.rustdocflags=[\"--cfg\", \"docsrs\", \"-Z\", \"unstable-options\", \"--emit=invocation-specific\", \"--resource-suffix\", \"-20250219-1.87.0-nightly-f280acf4c\", \"--static-root-path\", \"/-/rustdoc.static/\", \"--cap-lints\", \"warn\", \"--extern-html-root-takes-precedence\"]" "--offline" "-Zunstable-options" "--config=doc.extern-map.registries.crates-io=\"https://docs.rs/{pkg_name}/{version}/x86_64-unknown-linux-gnu\"" "-Zrustdoc-scrape-examples" "-j6" "--target" "x86_64-unknown-linux-gnu", kill_on_drop: false }`
[INFO] [stdout] 007fb09e3622a27f7329775e9e3271c961775fd62641a20ce7153386ab9632b5
[INFO] [stderr] WARNING: Your kernel does not support swap limit capabilities or the cgroup is not mounted. Memory limited without swap.
[INFO] running `Command { std: "docker" "start" "-a" "007fb09e3622a27f7329775e9e3271c961775fd62641a20ce7153386ab9632b5", kill_on_drop: false }`
[INFO] [stderr] warning: Rustdoc did not scrape the following examples because they require dev-dependencies: basic, benchmark, stream, train, zstd, zstdcat
[INFO] [stderr]     If you want Rustdoc to scrape these examples, then add `doc-scrape-examples = true`
[INFO] [stderr]     to the [[example]] target configuration of at least one example.
[INFO] [stderr] warning: target filter specified, but no targets matched; this is a no-op
[INFO] [stderr]     Checking zstd-safe v7.2.2
[INFO] [stderr] error[E0433]: failed to resolve: could not find `ZSTD_paramSwitch_e` in `zstd_sys`
[INFO] [stderr]     --> /opt/rustwide/cargo-home/registry/src/index.crates.io-1949cf8c6b5b557f/zstd-safe-7.2.2/src/lib.rs:2087:22
[INFO] [stderr]      |
[INFO] [stderr] 2087 |     Auto = zstd_sys::ZSTD_paramSwitch_e::ZSTD_ps_auto as u32,
[INFO] [stderr]      |                      ^^^^^^^^^^^^^^^^^^
[INFO] [stderr]      |                      |
[INFO] [stderr]      |                      could not find `ZSTD_paramSwitch_e` in `zstd_sys`
[INFO] [stderr]      |                      help: an enum with a similar name exists: `ZSTD_ParamSwitch_e`
[INFO] [stderr] 
[INFO] [stderr] error[E0433]: failed to resolve: could not find `ZSTD_paramSwitch_e` in `zstd_sys`
[INFO] [stderr]     --> /opt/rustwide/cargo-home/registry/src/index.crates.io-1949cf8c6b5b557f/zstd-safe-7.2.2/src/lib.rs:2088:24
[INFO] [stderr]      |
[INFO] [stderr] 2088 |     Enable = zstd_sys::ZSTD_paramSwitch_e::ZSTD_ps_enable as u32,
[INFO] [stderr]      |                        ^^^^^^^^^^^^^^^^^^
[INFO] [stderr]      |                        |
[INFO] [stderr]      |                        could not find `ZSTD_paramSwitch_e` in `zstd_sys`
[INFO] [stderr]      |                        help: an enum with a similar name exists: `ZSTD_ParamSwitch_e`
[INFO] [stderr] 
[INFO] [stderr] error[E0433]: failed to resolve: could not find `ZSTD_paramSwitch_e` in `zstd_sys`
[INFO] [stderr]     --> /opt/rustwide/cargo-home/registry/src/index.crates.io-1949cf8c6b5b557f/zstd-safe-7.2.2/src/lib.rs:2089:25
[INFO] [stderr]      |
[INFO] [stderr] 2089 |     Disable = zstd_sys::ZSTD_paramSwitch_e::ZSTD_ps_disable as u32,
[INFO] [stderr]      |                         ^^^^^^^^^^^^^^^^^^
[INFO] [stderr]      |                         |
[INFO] [stderr]      |                         could not find `ZSTD_paramSwitch_e` in `zstd_sys`
[INFO] [stderr]      |                         help: an enum with a similar name exists: `ZSTD_ParamSwitch_e`
[INFO] [stderr] 
[INFO] [stderr] For more information about this error, try `rustc --explain E0433`.
[INFO] [stderr] error: could not compile `zstd-safe` (lib) due to 3 previous errors
[INFO] running `Command { std: "docker" "inspect" "007fb09e3622a27f7329775e9e3271c961775fd62641a20ce7153386ab9632b5", kill_on_drop: false }`
[INFO] running `Command { std: "docker" "rm" "-f" "007fb09e3622a27f7329775e9e3271c961775fd62641a20ce7153386ab9632b5", kill_on_drop: false }`
[INFO] [stdout] 007fb09e3622a27f7329775e9e3271c961775fd62641a20ce7153386ab9632b5