datafusion 45.0.0

DataFusion is an in-memory query engine that uses Apache Arrow as the memory model
Documentation
Build #1718792 2025-02-07T16:12:21.481085+00:00
# rustc version
rustc 1.86.0-nightly (942db6782 2025-02-06)# docs.rs version
docsrs 0.6.0 (29a0e81b 2025-01-22)# build log
[INFO] running `Command { std: "docker" "create" "-v" "/home/cratesfyi/workspace-builder/builds/datafusion-45.0.0/target:/opt/rustwide/target:rw,Z" "-v" "/home/cratesfyi/workspace-builder/builds/datafusion-45.0.0/source:/opt/rustwide/workdir:ro,Z" "-v" "/home/cratesfyi/workspace-builder/cargo-home:/opt/rustwide/cargo-home:ro,Z" "-v" "/home/cratesfyi/workspace-builder/rustup-home:/opt/rustwide/rustup-home:ro,Z" "-e" "SOURCE_DIR=/opt/rustwide/workdir" "-e" "CARGO_TARGET_DIR=/opt/rustwide/target" "-e" "DOCS_RS=1" "-e" "CARGO_HOME=/opt/rustwide/cargo-home" "-e" "RUSTUP_HOME=/opt/rustwide/rustup-home" "-w" "/opt/rustwide/workdir" "-m" "6442450944" "--cpus" "6" "--user" "1001:1001" "--network" "none" "ghcr.io/rust-lang/crates-build-env/linux@sha256:3959728d45483eb673ba100a951a6b9f5012970368db2a9e08e0ac9b67c8a5ad" "/opt/rustwide/cargo-home/bin/cargo" "+nightly" "rustdoc" "--lib" "-Zrustdoc-map" "--config" "build.rustdocflags=[\"--cfg\", \"docsrs\", \"-Z\", \"unstable-options\", \"--emit=invocation-specific\", \"--resource-suffix\", \"-20250206-1.86.0-nightly-942db6782\", \"--static-root-path\", \"/-/rustdoc.static/\", \"--cap-lints\", \"warn\", \"--extern-html-root-takes-precedence\"]" "--offline" "-Zunstable-options" "--config=doc.extern-map.registries.crates-io=\"https://docs.rs/{pkg_name}/{version}/x86_64-apple-darwin\"" "-Zrustdoc-scrape-examples" "-j6" "--target" "x86_64-apple-darwin", kill_on_drop: false }`
[INFO] [stderr] WARNING: Your kernel does not support swap limit capabilities or the cgroup is not mounted. Memory limited without swap.
[INFO] [stdout] 365e1aaf17f964a843e5fbe89b9619df8f1966841f02368cbd6b832e8fec169e
[INFO] running `Command { std: "docker" "start" "-a" "365e1aaf17f964a843e5fbe89b9619df8f1966841f02368cbd6b832e8fec169e", kill_on_drop: false }`
[INFO] [stderr] warning: target filter specified, but no targets matched; this is a no-op
[INFO] [stderr]     Checking arrow-array v54.1.0
[INFO] [stderr]    Compiling zstd-sys v2.0.13+zstd.1.5.6
[INFO] [stderr]     Checking icu_normalizer v1.5.0
[INFO] [stderr]     Checking futures-io v0.3.31
[INFO] [stderr]     Checking base64 v0.22.1
[INFO] [stderr]     Checking itoa v1.0.14
[INFO] [stderr]     Checking pin-utils v0.1.0
[INFO] [stderr]     Checking regex-syntax v0.8.5
[INFO] [stderr]     Checking futures-task v0.3.31
[INFO] [stderr]     Checking futures-util v0.3.31
[INFO] [stderr]     Checking lock_api v0.4.12
[INFO] [stderr]     Checking parking_lot_core v0.9.10
[INFO] [stderr]     Checking idna_adapter v1.2.0
[INFO] [stderr]     Checking twox-hash v1.6.3
[INFO] [stderr]    Compiling flatbuffers v24.12.23
[INFO] [stderr]     Checking either v1.13.0
[INFO] [stderr]     Checking adler2 v2.0.0
[INFO] [stderr]     Checking bitflags v1.3.2
[INFO] [stderr]     Checking percent-encoding v2.3.1
[INFO] [stderr]     Checking equivalent v1.0.1
[INFO] [stderr]     Checking alloc-no-stdlib v2.0.4
[INFO] [stderr]     Checking form_urlencoded v1.2.1
[INFO] [stderr]     Checking alloc-stdlib v0.2.2
[INFO] [stderr]     Checking indexmap v2.7.1
[INFO] [stderr]     Checking miniz_oxide v0.8.3
[INFO] [stderr]     Checking lz4_flex v0.11.3
[INFO] [stderr]    Compiling psm v0.1.24
[INFO] [stderr] warning: psm@0.1.24: cc: error: unrecognized command-line option '-arch'
[INFO] [stderr] warning: psm@0.1.24: cc: error: unrecognized command-line option '-mmacosx-version-min=10.7'
[INFO] [stderr] error: failed to run custom build command for `psm v0.1.24`
[INFO] [stderr] 
[INFO] [stderr] Caused by:
[INFO] [stderr]   process didn't exit successfully: `/opt/rustwide/target/debug/build/psm-9ea194910b82a4e5/build-script-build` (exit status: 1)
[INFO] [stderr]   --- stdout
[INFO] [stderr]   OPT_LEVEL = Some(0)
[INFO] [stderr]   OUT_DIR = Some(/opt/rustwide/target/x86_64-apple-darwin/debug/build/psm-17df3e1e9f112098/out)
[INFO] [stderr]   TARGET = Some(x86_64-apple-darwin)
[INFO] [stderr]   HOST = Some(x86_64-unknown-linux-gnu)
[INFO] [stderr]   cargo:rerun-if-env-changed=CC_x86_64-apple-darwin
[INFO] [stderr]   CC_x86_64-apple-darwin = None
[INFO] [stderr]   cargo:rerun-if-env-changed=CC_x86_64_apple_darwin
[INFO] [stderr]   CC_x86_64_apple_darwin = None
[INFO] [stderr]   cargo:rerun-if-env-changed=TARGET_CC
[INFO] [stderr]   TARGET_CC = None
[INFO] [stderr]   cargo:rerun-if-env-changed=CC
[INFO] [stderr]   CC = None
[INFO] [stderr]   cargo:rerun-if-env-changed=CROSS_COMPILE
[INFO] [stderr]   CROSS_COMPILE = None
[INFO] [stderr]   RUSTC_LINKER = None
[INFO] [stderr]   cargo:rerun-if-env-changed=CC_ENABLE_DEBUG_OUTPUT
[INFO] [stderr]   RUSTC_WRAPPER = None
[INFO] [stderr]   cargo:rerun-if-env-changed=CRATE_CC_NO_DEFAULTS
[INFO] [stderr]   CRATE_CC_NO_DEFAULTS = None
[INFO] [stderr]   DEBUG = Some(true)
[INFO] [stderr]   CARGO_CFG_TARGET_FEATURE = Some(cmpxchg16b,fxsr,lahfsahf,sse,sse2,sse3,sse4.1,ssse3,x87)
[INFO] [stderr]   cargo:rerun-if-env-changed=MACOSX_DEPLOYMENT_TARGET
[INFO] [stderr]   MACOSX_DEPLOYMENT_TARGET = None
[INFO] [stderr]   cargo:rerun-if-env-changed=CFLAGS_x86_64-apple-darwin
[INFO] [stderr]   CFLAGS_x86_64-apple-darwin = None
[INFO] [stderr]   cargo:rerun-if-env-changed=CFLAGS_x86_64_apple_darwin
[INFO] [stderr]   CFLAGS_x86_64_apple_darwin = None
[INFO] [stderr]   cargo:rerun-if-env-changed=TARGET_CFLAGS
[INFO] [stderr]   TARGET_CFLAGS = None
[INFO] [stderr]   cargo:rerun-if-env-changed=CFLAGS
[INFO] [stderr]   CFLAGS = None
[INFO] [stderr]   CARGO_ENCODED_RUSTFLAGS = Some()
[INFO] [stderr]   cargo:rustc-check-cfg=cfg(switchable_stack,asm,link_asm)
[INFO] [stderr]   cargo:rustc-cfg=asm
[INFO] [stderr]   cargo:rustc-cfg=link_asm
[INFO] [stderr]   cargo:rustc-cfg=switchable_stack
[INFO] [stderr]   cargo:warning=cc: error: unrecognized command-line option '-arch'
[INFO] [stderr]   cargo:warning=cc: error: unrecognized command-line option '-mmacosx-version-min=10.7'
[INFO] [stderr] 
[INFO] [stderr]   --- stderr
[INFO] [stderr] 
[INFO] [stderr] 
[INFO] [stderr]   error occurred in cc-rs: Command LC_ALL="C" "cc" "-O0" "-ffunction-sections" "-fdata-sections" "-fPIC" "-gdwarf-2" "-fno-omit-frame-pointer" "-m64" "-arch" "x86_64" "-mmacosx-version-min=10.7" "-Wall" "-Wextra" "-xassembler-with-cpp" "-DCFG_TARGET_OS_macos" "-DCFG_TARGET_ARCH_x86_64" "-DCFG_TARGET_ENV_" "-o" "/opt/rustwide/target/x86_64-apple-darwin/debug/build/psm-17df3e1e9f112098/out/4f9a91766097c4c5-x86_64.o" "-c" "src/arch/x86_64.s" with args cc did not execute successfully (status code exit status: 1).
[INFO] [stderr] 
[INFO] [stderr] 
[INFO] [stderr] warning: build failed, waiting for other jobs to finish...
[INFO] [stderr] warning: zstd-sys@2.0.13+zstd.1.5.6: cc: error: unrecognized command-line option '-arch'
[INFO] [stderr] warning: zstd-sys@2.0.13+zstd.1.5.6: cc: error: unrecognized command-line option '-mmacosx-version-min=10.7'
[INFO] [stderr] warning: zstd-sys@2.0.13+zstd.1.5.6: ToolExecError: Command LC_ALL="C" "cc" "-O0" "-ffunction-sections" "-fdata-sections" "-fPIC" "-gdwarf-2" "-fno-omit-frame-pointer" "-m64" "-arch" "x86_64" "-mmacosx-version-min=10.7" "-I" "zstd/lib/" "-I" "zstd/lib/common" "-fvisibility=hidden" "-DZSTD_LIB_DEPRECATED=0" "-DXXH_PRIVATE_API=" "-DZSTDLIB_VISIBILITY=" "-DZSTDERRORLIB_VISIBILITY=" "-o" "/opt/rustwide/target/x86_64-apple-darwin/debug/build/zstd-sys-d1cb833694e3dd30/out/44ff4c55aa9e5133-debug.o" "-c" "zstd/lib/common/debug.c" with args cc did not execute successfully (status code exit status: 1).cargo:warning=cc: error: unrecognized command-line option '-arch'
[INFO] [stderr] warning: zstd-sys@2.0.13+zstd.1.5.6: cc: error: unrecognized command-line option '-mmacosx-version-min=10.7'
[INFO] [stderr] warning: zstd-sys@2.0.13+zstd.1.5.6: ToolExecError: Command LC_ALL="C" "cc" "-O0" "-ffunction-sections" "-fdata-sections" "-fPIC" "-gdwarf-2" "-fno-omit-frame-pointer" "-m64" "-arch" "x86_64" "-mmacosx-version-min=10.7" "-I" "zstd/lib/" "-I" "zstd/lib/common" "-fvisibility=hidden" "-DZSTD_LIB_DEPRECATED=0" "-DXXH_PRIVATE_API=" "-DZSTDLIB_VISIBILITY=" "-DZSTDERRORLIB_VISIBILITY=" "-o" "/opt/rustwide/target/x86_64-apple-darwin/debug/build/zstd-sys-d1cb833694e3dd30/out/44ff4c55aa9e5133-entropy_common.o" "-c" "zstd/lib/common/entropy_common.c" with args cc did not execute successfully (status code exit status: 1).cargo:warning=cc: error: unrecognized command-line option '-arch'
[INFO] [stderr] warning: zstd-sys@2.0.13+zstd.1.5.6: cc: error: unrecognized command-line option '-mmacosx-version-min=10.7'
[INFO] [stderr] warning: zstd-sys@2.0.13+zstd.1.5.6: ToolExecError: Command LC_ALL="C" "cc" "-O0" "-ffunction-sections" "-fdata-sections" "-fPIC" "-gdwarf-2" "-fno-omit-frame-pointer" "-m64" "-arch" "x86_64" "-mmacosx-version-min=10.7" "-I" "zstd/lib/" "-I" "zstd/lib/common" "-fvisibility=hidden" "-DZSTD_LIB_DEPRECATED=0" "-DXXH_PRIVATE_API=" "-DZSTDLIB_VISIBILITY=" "-DZSTDERRORLIB_VISIBILITY=" "-o" "/opt/rustwide/target/x86_64-apple-darwin/debug/build/zstd-sys-d1cb833694e3dd30/out/44ff4c55aa9e5133-error_private.o" "-c" "zstd/lib/common/error_private.c" with args cc did not execute successfully (status code exit status: 1).cargo:warning=cc: error: unrecognized command-line option '-arch'
[INFO] [stderr] warning: zstd-sys@2.0.13+zstd.1.5.6: cc: error: unrecognized command-line option '-mmacosx-version-min=10.7'
[INFO] [stderr] warning: zstd-sys@2.0.13+zstd.1.5.6: ToolExecError: Command LC_ALL="C" "cc" "-O0" "-ffunction-sections" "-fdata-sections" "-fPIC" "-gdwarf-2" "-fno-omit-frame-pointer" "-m64" "-arch" "x86_64" "-mmacosx-version-min=10.7" "-I" "zstd/lib/" "-I" "zstd/lib/common" "-fvisibility=hidden" "-DZSTD_LIB_DEPRECATED=0" "-DXXH_PRIVATE_API=" "-DZSTDLIB_VISIBILITY=" "-DZSTDERRORLIB_VISIBILITY=" "-o" "/opt/rustwide/target/x86_64-apple-darwin/debug/build/zstd-sys-d1cb833694e3dd30/out/44ff4c55aa9e5133-fse_decompress.o" "-c" "zstd/lib/common/fse_decompress.c" with args cc did not execute successfully (status code exit status: 1).cargo:warning=cc: error: unrecognized command-line option '-arch'
[INFO] [stderr] warning: zstd-sys@2.0.13+zstd.1.5.6: cc: error: unrecognized command-line option '-mmacosx-version-min=10.7'
[INFO] [stderr] warning: zstd-sys@2.0.13+zstd.1.5.6: ToolExecError: Command LC_ALL="C" "cc" "-O0" "-ffunction-sections" "-fdata-sections" "-fPIC" "-gdwarf-2" "-fno-omit-frame-pointer" "-m64" "-arch" "x86_64" "-mmacosx-version-min=10.7" "-I" "zstd/lib/" "-I" "zstd/lib/common" "-fvisibility=hidden" "-DZSTD_LIB_DEPRECATED=0" "-DXXH_PRIVATE_API=" "-DZSTDLIB_VISIBILITY=" "-DZSTDERRORLIB_VISIBILITY=" "-o" "/opt/rustwide/target/x86_64-apple-darwin/debug/build/zstd-sys-d1cb833694e3dd30/out/44ff4c55aa9e5133-pool.o" "-c" "zstd/lib/common/pool.c" with args cc did not execute successfully (status code exit status: 1).cargo:warning=cc: error: unrecognized command-line option '-arch'
[INFO] [stderr] warning: zstd-sys@2.0.13+zstd.1.5.6: cc: error: unrecognized command-line option '-mmacosx-version-min=10.7'
[INFO] [stderr] warning: zstd-sys@2.0.13+zstd.1.5.6: ToolExecError: Command LC_ALL="C" "cc" "-O0" "-ffunction-sections" "-fdata-sections" "-fPIC" "-gdwarf-2" "-fno-omit-frame-pointer" "-m64" "-arch" "x86_64" "-mmacosx-version-min=10.7" "-I" "zstd/lib/" "-I" "zstd/lib/common" "-fvisibility=hidden" "-DZSTD_LIB_DEPRECATED=0" "-DXXH_PRIVATE_API=" "-DZSTDLIB_VISIBILITY=" "-DZSTDERRORLIB_VISIBILITY=" "-o" "/opt/rustwide/target/x86_64-apple-darwin/debug/build/zstd-sys-d1cb833694e3dd30/out/44ff4c55aa9e5133-threading.o" "-c" "zstd/lib/common/threading.c" with args cc did not execute successfully (status code exit status: 1).cargo:warning=cc: error: unrecognized command-line option '-arch'
[INFO] [stderr] warning: zstd-sys@2.0.13+zstd.1.5.6: cc: error: unrecognized command-line option '-mmacosx-version-min=10.7'
[INFO] [stderr] warning: zstd-sys@2.0.13+zstd.1.5.6: ToolExecError: Command LC_ALL="C" "cc" "-O0" "-ffunction-sections" "-fdata-sections" "-fPIC" "-gdwarf-2" "-fno-omit-frame-pointer" "-m64" "-arch" "x86_64" "-mmacosx-version-min=10.7" "-I" "zstd/lib/" "-I" "zstd/lib/common" "-fvisibility=hidden" "-DZSTD_LIB_DEPRECATED=0" "-DXXH_PRIVATE_API=" "-DZSTDLIB_VISIBILITY=" "-DZSTDERRORLIB_VISIBILITY=" "-o" "/opt/rustwide/target/x86_64-apple-darwin/debug/build/zstd-sys-d1cb833694e3dd30/out/44ff4c55aa9e5133-zstd_common.o" "-c" "zstd/lib/common/zstd_common.c" with args cc did not execute successfully (status code exit status: 1).cargo:warning=cc: error: unrecognized command-line option '-arch'
[INFO] [stderr] warning: zstd-sys@2.0.13+zstd.1.5.6: cc: error: unrecognized command-line option '-mmacosx-version-min=10.7'
[INFO] [stderr] warning: zstd-sys@2.0.13+zstd.1.5.6: ToolExecError: Command LC_ALL="C" "cc" "-O0" "-ffunction-sections" "-fdata-sections" "-fPIC" "-gdwarf-2" "-fno-omit-frame-pointer" "-m64" "-arch" "x86_64" "-mmacosx-version-min=10.7" "-I" "zstd/lib/" "-I" "zstd/lib/common" "-fvisibility=hidden" "-DZSTD_LIB_DEPRECATED=0" "-DXXH_PRIVATE_API=" "-DZSTDLIB_VISIBILITY=" "-DZSTDERRORLIB_VISIBILITY=" "-o" "/opt/rustwide/target/x86_64-apple-darwin/debug/build/zstd-sys-d1cb833694e3dd30/out/fb80479a5fb81f6a-fse_compress.o" "-c" "zstd/lib/compress/fse_compress.c" with args cc did not execute successfully (status code exit status: 1).cargo:warning=cc: error: unrecognized command-line option '-arch'
[INFO] [stderr] warning: zstd-sys@2.0.13+zstd.1.5.6: cc: error: unrecognized command-line option '-mmacosx-version-min=10.7'
[INFO] [stderr] warning: zstd-sys@2.0.13+zstd.1.5.6: ToolExecError: Command LC_ALL="C" "cc" "-O0" "-ffunction-sections" "-fdata-sections" "-fPIC" "-gdwarf-2" "-fno-omit-frame-pointer" "-m64" "-arch" "x86_64" "-mmacosx-version-min=10.7" "-I" "zstd/lib/" "-I" "zstd/lib/common" "-fvisibility=hidden" "-DZSTD_LIB_DEPRECATED=0" "-DXXH_PRIVATE_API=" "-DZSTDLIB_VISIBILITY=" "-DZSTDERRORLIB_VISIBILITY=" "-o" "/opt/rustwide/target/x86_64-apple-darwin/debug/build/zstd-sys-d1cb833694e3dd30/out/fb80479a5fb81f6a-hist.o" "-c" "zstd/lib/compress/hist.c" with args cc did not execute successfully (status code exit status: 1).cargo:warning=cc: error: unrecognized command-line option '-arch'
[INFO] [stderr] warning: zstd-sys@2.0.13+zstd.1.5.6: cc: error: unrecognized command-line option '-mmacosx-version-min=10.7'
[INFO] [stderr] warning: zstd-sys@2.0.13+zstd.1.5.6: ToolExecError: Command LC_ALL="C" "cc" "-O0" "-ffunction-sections" "-fdata-sections" "-fPIC" "-gdwarf-2" "-fno-omit-frame-pointer" "-m64" "-arch" "x86_64" "-mmacosx-version-min=10.7" "-I" "zstd/lib/" "-I" "zstd/lib/common" "-fvisibility=hidden" "-DZSTD_LIB_DEPRECATED=0" "-DXXH_PRIVATE_API=" "-DZSTDLIB_VISIBILITY=" "-DZSTDERRORLIB_VISIBILITY=" "-o" "/opt/rustwide/target/x86_64-apple-darwin/debug/build/zstd-sys-d1cb833694e3dd30/out/fb80479a5fb81f6a-huf_compress.o" "-c" "zstd/lib/compress/huf_compress.c" with args cc did not execute successfully (status code exit status: 1).cargo:warning=cc: error: unrecognized command-line option '-arch'
[INFO] [stderr] warning: zstd-sys@2.0.13+zstd.1.5.6: cc: error: unrecognized command-line option '-mmacosx-version-min=10.7'
[INFO] [stderr] warning: zstd-sys@2.0.13+zstd.1.5.6: ToolExecError: Command LC_ALL="C" "cc" "-O0" "-ffunction-sections" "-fdata-sections" "-fPIC" "-gdwarf-2" "-fno-omit-frame-pointer" "-m64" "-arch" "x86_64" "-mmacosx-version-min=10.7" "-I" "zstd/lib/" "-I" "zstd/lib/common" "-fvisibility=hidden" "-DZSTD_LIB_DEPRECATED=0" "-DXXH_PRIVATE_API=" "-DZSTDLIB_VISIBILITY=" "-DZSTDERRORLIB_VISIBILITY=" "-o" "/opt/rustwide/target/x86_64-apple-darwin/debug/build/zstd-sys-d1cb833694e3dd30/out/fb80479a5fb81f6a-zstd_compress.o" "-c" "zstd/lib/compress/zstd_compress.c" with args cc did not execute successfully (status code exit status: 1).cargo:warning=cc: error: unrecognized command-line option '-arch'
[INFO] [stderr] warning: zstd-sys@2.0.13+zstd.1.5.6: cc: error: unrecognized command-line option '-mmacosx-version-min=10.7'
[INFO] [stderr] warning: zstd-sys@2.0.13+zstd.1.5.6: ToolExecError: Command LC_ALL="C" "cc" "-O0" "-ffunction-sections" "-fdata-sections" "-fPIC" "-gdwarf-2" "-fno-omit-frame-pointer" "-m64" "-arch" "x86_64" "-mmacosx-version-min=10.7" "-I" "zstd/lib/" "-I" "zstd/lib/common" "-fvisibility=hidden" "-DZSTD_LIB_DEPRECATED=0" "-DXXH_PRIVATE_API=" "-DZSTDLIB_VISIBILITY=" "-DZSTDERRORLIB_VISIBILITY=" "-o" "/opt/rustwide/target/x86_64-apple-darwin/debug/build/zstd-sys-d1cb833694e3dd30/out/fb80479a5fb81f6a-zstd_compress_literals.o" "-c" "zstd/lib/compress/zstd_compress_literals.c" with args cc did not execute successfully (status code exit status: 1).cargo:warning=cc: error: unrecognized command-line option '-arch'
[INFO] [stderr] warning: zstd-sys@2.0.13+zstd.1.5.6: cc: error: unrecognized command-line option '-mmacosx-version-min=10.7'
[INFO] [stderr] warning: zstd-sys@2.0.13+zstd.1.5.6: ToolExecError: Command LC_ALL="C" "cc" "-O0" "-ffunction-sections" "-fdata-sections" "-fPIC" "-gdwarf-2" "-fno-omit-frame-pointer" "-m64" "-arch" "x86_64" "-mmacosx-version-min=10.7" "-I" "zstd/lib/" "-I" "zstd/lib/common" "-fvisibility=hidden" "-DZSTD_LIB_DEPRECATED=0" "-DXXH_PRIVATE_API=" "-DZSTDLIB_VISIBILITY=" "-DZSTDERRORLIB_VISIBILITY=" "-o" "/opt/rustwide/target/x86_64-apple-darwin/debug/build/zstd-sys-d1cb833694e3dd30/out/fb80479a5fb81f6a-zstd_compress_sequences.o" "-c" "zstd/lib/compress/zstd_compress_sequences.c" with args cc did not execute successfully (status code exit status: 1).cargo:warning=cc: error: unrecognized command-line option '-arch'
[INFO] [stderr] warning: zstd-sys@2.0.13+zstd.1.5.6: cc: error: unrecognized command-line option '-mmacosx-version-min=10.7'
[INFO] [stderr] warning: zstd-sys@2.0.13+zstd.1.5.6: ToolExecError: Command LC_ALL="C" "cc" "-O0" "-ffunction-sections" "-fdata-sections" "-fPIC" "-gdwarf-2" "-fno-omit-frame-pointer" "-m64" "-arch" "x86_64" "-mmacosx-version-min=10.7" "-I" "zstd/lib/" "-I" "zstd/lib/common" "-fvisibility=hidden" "-DZSTD_LIB_DEPRECATED=0" "-DXXH_PRIVATE_API=" "-DZSTDLIB_VISIBILITY=" "-DZSTDERRORLIB_VISIBILITY=" "-o" "/opt/rustwide/target/x86_64-apple-darwin/debug/build/zstd-sys-d1cb833694e3dd30/out/fb80479a5fb81f6a-zstd_compress_superblock.o" "-c" "zstd/lib/compress/zstd_compress_superblock.c" with args cc did not execute successfully (status code exit status: 1).cargo:warning=cc: error: unrecognized command-line option '-arch'
[INFO] [stderr] warning: zstd-sys@2.0.13+zstd.1.5.6: cc: error: unrecognized command-line option '-mmacosx-version-min=10.7'
[INFO] [stderr] warning: zstd-sys@2.0.13+zstd.1.5.6: ToolExecError: Command LC_ALL="C" "cc" "-O0" "-ffunction-sections" "-fdata-sections" "-fPIC" "-gdwarf-2" "-fno-omit-frame-pointer" "-m64" "-arch" "x86_64" "-mmacosx-version-min=10.7" "-I" "zstd/lib/" "-I" "zstd/lib/common" "-fvisibility=hidden" "-DZSTD_LIB_DEPRECATED=0" "-DXXH_PRIVATE_API=" "-DZSTDLIB_VISIBILITY=" "-DZSTDERRORLIB_VISIBILITY=" "-o" "/opt/rustwide/target/x86_64-apple-darwin/debug/build/zstd-sys-d1cb833694e3dd30/out/fb80479a5fb81f6a-zstd_double_fast.o" "-c" "zstd/lib/compress/zstd_double_fast.c" with args cc did not execute successfully (status code exit status: 1).cargo:warning=cc: error: unrecognized command-line option '-arch'
[INFO] [stderr] warning: zstd-sys@2.0.13+zstd.1.5.6: cc: error: unrecognized command-line option '-mmacosx-version-min=10.7'
[INFO] [stderr] warning: zstd-sys@2.0.13+zstd.1.5.6: ToolExecError: Command LC_ALL="C" "cc" "-O0" "-ffunction-sections" "-fdata-sections" "-fPIC" "-gdwarf-2" "-fno-omit-frame-pointer" "-m64" "-arch" "x86_64" "-mmacosx-version-min=10.7" "-I" "zstd/lib/" "-I" "zstd/lib/common" "-fvisibility=hidden" "-DZSTD_LIB_DEPRECATED=0" "-DXXH_PRIVATE_API=" "-DZSTDLIB_VISIBILITY=" "-DZSTDERRORLIB_VISIBILITY=" "-o" "/opt/rustwide/target/x86_64-apple-darwin/debug/build/zstd-sys-d1cb833694e3dd30/out/fb80479a5fb81f6a-zstd_fast.o" "-c" "zstd/lib/compress/zstd_fast.c" with args cc did not execute successfully (status code exit status: 1).cargo:warning=cc: error: unrecognized command-line option '-arch'
[INFO] [stderr] warning: zstd-sys@2.0.13+zstd.1.5.6: cc: error: unrecognized command-line option '-mmacosx-version-min=10.7'
[INFO] [stderr] warning: zstd-sys@2.0.13+zstd.1.5.6: ToolExecError: Command LC_ALL="C" "cc" "-O0" "-ffunction-sections" "-fdata-sections" "-fPIC" "-gdwarf-2" "-fno-omit-frame-pointer" "-m64" "-arch" "x86_64" "-mmacosx-version-min=10.7" "-I" "zstd/lib/" "-I" "zstd/lib/common" "-fvisibility=hidden" "-DZSTD_LIB_DEPRECATED=0" "-DXXH_PRIVATE_API=" "-DZSTDLIB_VISIBILITY=" "-DZSTDERRORLIB_VISIBILITY=" "-o" "/opt/rustwide/target/x86_64-apple-darwin/debug/build/zstd-sys-d1cb833694e3dd30/out/fb80479a5fb81f6a-zstd_lazy.o" "-c" "zstd/lib/compress/zstd_lazy.c" with args cc did not execute successfully (status code exit status: 1).cargo:warning=cc: error: unrecognized command-line option '-arch'
[INFO] [stderr] warning: zstd-sys@2.0.13+zstd.1.5.6: cc: error: unrecognized command-line option '-mmacosx-version-min=10.7'
[INFO] [stderr] warning: zstd-sys@2.0.13+zstd.1.5.6: ToolExecError: Command LC_ALL="C" "cc" "-O0" "-ffunction-sections" "-fdata-sections" "-fPIC" "-gdwarf-2" "-fno-omit-frame-pointer" "-m64" "-arch" "x86_64" "-mmacosx-version-min=10.7" "-I" "zstd/lib/" "-I" "zstd/lib/common" "-fvisibility=hidden" "-DZSTD_LIB_DEPRECATED=0" "-DXXH_PRIVATE_API=" "-DZSTDLIB_VISIBILITY=" "-DZSTDERRORLIB_VISIBILITY=" "-o" "/opt/rustwide/target/x86_64-apple-darwin/debug/build/zstd-sys-d1cb833694e3dd30/out/fb80479a5fb81f6a-zstd_ldm.o" "-c" "zstd/lib/compress/zstd_ldm.c" with args cc did not execute successfully (status code exit status: 1).cargo:warning=cc: error: unrecognized command-line option '-arch'
[INFO] [stderr] warning: zstd-sys@2.0.13+zstd.1.5.6: cc: error: unrecognized command-line option '-mmacosx-version-min=10.7'
[INFO] [stderr] warning: zstd-sys@2.0.13+zstd.1.5.6: ToolExecError: Command LC_ALL="C" "cc" "-O0" "-ffunction-sections" "-fdata-sections" "-fPIC" "-gdwarf-2" "-fno-omit-frame-pointer" "-m64" "-arch" "x86_64" "-mmacosx-version-min=10.7" "-I" "zstd/lib/" "-I" "zstd/lib/common" "-fvisibility=hidden" "-DZSTD_LIB_DEPRECATED=0" "-DXXH_PRIVATE_API=" "-DZSTDLIB_VISIBILITY=" "-DZSTDERRORLIB_VISIBILITY=" "-o" "/opt/rustwide/target/x86_64-apple-darwin/debug/build/zstd-sys-d1cb833694e3dd30/out/fb80479a5fb81f6a-zstd_opt.o" "-c" "zstd/lib/compress/zstd_opt.c" with args cc did not execute successfully (status code exit status: 1).cargo:warning=cc: error: unrecognized command-line option '-arch'
[INFO] [stderr] warning: zstd-sys@2.0.13+zstd.1.5.6: cc: error: unrecognized command-line option '-mmacosx-version-min=10.7'
[INFO] [stderr] warning: zstd-sys@2.0.13+zstd.1.5.6: ToolExecError: Command LC_ALL="C" "cc" "-O0" "-ffunction-sections" "-fdata-sections" "-fPIC" "-gdwarf-2" "-fno-omit-frame-pointer" "-m64" "-arch" "x86_64" "-mmacosx-version-min=10.7" "-I" "zstd/lib/" "-I" "zstd/lib/common" "-fvisibility=hidden" "-DZSTD_LIB_DEPRECATED=0" "-DXXH_PRIVATE_API=" "-DZSTDLIB_VISIBILITY=" "-DZSTDERRORLIB_VISIBILITY=" "-o" "/opt/rustwide/target/x86_64-apple-darwin/debug/build/zstd-sys-d1cb833694e3dd30/out/fb80479a5fb81f6a-zstdmt_compress.o" "-c" "zstd/lib/compress/zstdmt_compress.c" with args cc did not execute successfully (status code exit status: 1).cargo:warning=cc: error: unrecognized command-line option '-arch'
[INFO] [stderr] warning: zstd-sys@2.0.13+zstd.1.5.6: cc: error: unrecognized command-line option '-mmacosx-version-min=10.7'
[INFO] [stderr] warning: zstd-sys@2.0.13+zstd.1.5.6: ToolExecError: Command LC_ALL="C" "cc" "-O0" "-ffunction-sections" "-fdata-sections" "-fPIC" "-gdwarf-2" "-fno-omit-frame-pointer" "-m64" "-arch" "x86_64" "-mmacosx-version-min=10.7" "-I" "zstd/lib/" "-I" "zstd/lib/common" "-fvisibility=hidden" "-DZSTD_LIB_DEPRECATED=0" "-DXXH_PRIVATE_API=" "-DZSTDLIB_VISIBILITY=" "-DZSTDERRORLIB_VISIBILITY=" "-o" "/opt/rustwide/target/x86_64-apple-darwin/debug/build/zstd-sys-d1cb833694e3dd30/out/88f362f13b0528ed-huf_decompress.o" "-c" "zstd/lib/decompress/huf_decompress.c" with args cc did not execute successfully (status code exit status: 1).cargo:warning=cc: error: unrecognized command-line option '-arch'
[INFO] [stderr] warning: zstd-sys@2.0.13+zstd.1.5.6: cc: error: unrecognized command-line option '-mmacosx-version-min=10.7'
[INFO] [stderr] warning: zstd-sys@2.0.13+zstd.1.5.6: ToolExecError: Command LC_ALL="C" "cc" "-O0" "-ffunction-sections" "-fdata-sections" "-fPIC" "-gdwarf-2" "-fno-omit-frame-pointer" "-m64" "-arch" "x86_64" "-mmacosx-version-min=10.7" "-I" "zstd/lib/" "-I" "zstd/lib/common" "-fvisibility=hidden" "-DZSTD_LIB_DEPRECATED=0" "-DXXH_PRIVATE_API=" "-DZSTDLIB_VISIBILITY=" "-DZSTDERRORLIB_VISIBILITY=" "-o" "/opt/rustwide/target/x86_64-apple-darwin/debug/build/zstd-sys-d1cb833694e3dd30/out/88f362f13b0528ed-zstd_ddict.o" "-c" "zstd/lib/decompress/zstd_ddict.c" with args cc did not execute successfully (status code exit status: 1).cargo:warning=cc: error: unrecognized command-line option '-arch'
[INFO] [stderr] warning: zstd-sys@2.0.13+zstd.1.5.6: cc: error: unrecognized command-line option '-mmacosx-version-min=10.7'
[INFO] [stderr] warning: zstd-sys@2.0.13+zstd.1.5.6: ToolExecError: Command LC_ALL="C" "cc" "-O0" "-ffunction-sections" "-fdata-sections" "-fPIC" "-gdwarf-2" "-fno-omit-frame-pointer" "-m64" "-arch" "x86_64" "-mmacosx-version-min=10.7" "-I" "zstd/lib/" "-I" "zstd/lib/common" "-fvisibility=hidden" "-DZSTD_LIB_DEPRECATED=0" "-DXXH_PRIVATE_API=" "-DZSTDLIB_VISIBILITY=" "-DZSTDERRORLIB_VISIBILITY=" "-o" "/opt/rustwide/target/x86_64-apple-darwin/debug/build/zstd-sys-d1cb833694e3dd30/out/88f362f13b0528ed-zstd_decompress.o" "-c" "zstd/lib/decompress/zstd_decompress.c" with args cc did not execute successfully (status code exit status: 1).cargo:warning=cc: error: unrecognized command-line option '-arch'
[INFO] [stderr] warning: zstd-sys@2.0.13+zstd.1.5.6: cc: error: unrecognized command-line option '-mmacosx-version-min=10.7'
[INFO] [stderr] warning: zstd-sys@2.0.13+zstd.1.5.6: ToolExecError: Command LC_ALL="C" "cc" "-O0" "-ffunction-sections" "-fdata-sections" "-fPIC" "-gdwarf-2" "-fno-omit-frame-pointer" "-m64" "-arch" "x86_64" "-mmacosx-version-min=10.7" "-I" "zstd/lib/" "-I" "zstd/lib/common" "-fvisibility=hidden" "-DZSTD_LIB_DEPRECATED=0" "-DXXH_PRIVATE_API=" "-DZSTDLIB_VISIBILITY=" "-DZSTDERRORLIB_VISIBILITY=" "-o" "/opt/rustwide/target/x86_64-apple-darwin/debug/build/zstd-sys-d1cb833694e3dd30/out/88f362f13b0528ed-zstd_decompress_block.o" "-c" "zstd/lib/decompress/zstd_decompress_block.c" with args cc did not execute successfully (status code exit status: 1).cargo:warning=cc: error: unrecognized command-line option '-arch'
[INFO] [stderr] warning: zstd-sys@2.0.13+zstd.1.5.6: cc: error: unrecognized command-line option '-mmacosx-version-min=10.7'
[INFO] [stderr] warning: zstd-sys@2.0.13+zstd.1.5.6: ToolExecError: Command LC_ALL="C" "cc" "-O0" "-ffunction-sections" "-fdata-sections" "-fPIC" "-gdwarf-2" "-fno-omit-frame-pointer" "-m64" "-arch" "x86_64" "-mmacosx-version-min=10.7" "-I" "zstd/lib/" "-I" "zstd/lib/common" "-fvisibility=hidden" "-DZSTD_LIB_DEPRECATED=0" "-DXXH_PRIVATE_API=" "-DZSTDLIB_VISIBILITY=" "-DZSTDERRORLIB_VISIBILITY=" "-o" "/opt/rustwide/target/x86_64-apple-darwin/debug/build/zstd-sys-d1cb833694e3dd30/out/7faed3f8272f2313-huf_decompress_amd64.o" "-c" "zstd/lib/decompress/huf_decompress_amd64.S" with args cc did not execute successfully (status code exit status: 1).
[INFO] [stderr] error: failed to run custom build command for `zstd-sys v2.0.13+zstd.1.5.6`
[INFO] [stderr] 
[INFO] [stderr] Caused by:
[INFO] [stderr]   process didn't exit successfully: `/opt/rustwide/target/debug/build/zstd-sys-df77e1bc35927c0b/build-script-build` (exit status: 1)
[INFO] [stderr]   --- stdout
[INFO] [stderr]   cargo:rerun-if-env-changed=ZSTD_SYS_USE_PKG_CONFIG
[INFO] [stderr]   OUT_DIR = Some(/opt/rustwide/target/x86_64-apple-darwin/debug/build/zstd-sys-d1cb833694e3dd30/out)
[INFO] [stderr]   OPT_LEVEL = Some(0)
[INFO] [stderr]   TARGET = Some(x86_64-apple-darwin)
[INFO] [stderr]   HOST = Some(x86_64-unknown-linux-gnu)
[INFO] [stderr]   cargo:rerun-if-env-changed=CC_x86_64-apple-darwin
[INFO] [stderr]   CC_x86_64-apple-darwin = None
[INFO] [stderr]   cargo:rerun-if-env-changed=CC_x86_64_apple_darwin
[INFO] [stderr]   CC_x86_64_apple_darwin = None
[INFO] [stderr]   cargo:rerun-if-env-changed=TARGET_CC
[INFO] [stderr]   TARGET_CC = None
[INFO] [stderr]   cargo:rerun-if-env-changed=CC
[INFO] [stderr]   CC = None
[INFO] [stderr]   cargo:rerun-if-env-changed=CROSS_COMPILE
[INFO] [stderr]   CROSS_COMPILE = None
[INFO] [stderr]   RUSTC_LINKER = None
[INFO] [stderr]   cargo:rerun-if-env-changed=CC_ENABLE_DEBUG_OUTPUT
[INFO] [stderr]   RUSTC_WRAPPER = None
[INFO] [stderr]   cargo:rerun-if-env-changed=CRATE_CC_NO_DEFAULTS
[INFO] [stderr]   CRATE_CC_NO_DEFAULTS = None
[INFO] [stderr]   DEBUG = Some(true)
[INFO] [stderr]   CARGO_CFG_TARGET_FEATURE = Some(cmpxchg16b,fxsr,lahfsahf,sse,sse2,sse3,sse4.1,ssse3,x87)
[INFO] [stderr]   cargo:rerun-if-env-changed=MACOSX_DEPLOYMENT_TARGET
[INFO] [stderr]   MACOSX_DEPLOYMENT_TARGET = None
[INFO] [stderr]   cargo:rerun-if-env-changed=CFLAGS_x86_64-apple-darwin
[INFO] [stderr]   CFLAGS_x86_64-apple-darwin = None
[INFO] [stderr]   cargo:rerun-if-env-changed=CFLAGS_x86_64_apple_darwin
[INFO] [stderr]   CFLAGS_x86_64_apple_darwin = None
[INFO] [stderr]   cargo:rerun-if-env-changed=TARGET_CFLAGS
[INFO] [stderr]   TARGET_CFLAGS = None
[INFO] [stderr]   cargo:rerun-if-env-changed=CFLAGS
[INFO] [stderr]   CFLAGS = None
[INFO] [stderr]   CARGO_ENCODED_RUSTFLAGS = Some()
[INFO] [stderr]   OUT_DIR = Some(/opt/rustwide/target/x86_64-apple-darwin/debug/build/zstd-sys-d1cb833694e3dd30/out)
[INFO] [stderr]   cargo:rerun-if-env-changed=CC_ENABLE_DEBUG_OUTPUT
[INFO] [stderr]   cargo:rerun-if-env-changed=CRATE_CC_NO_DEFAULTS
[INFO] [stderr]   CRATE_CC_NO_DEFAULTS = None
[INFO] [stderr]   TARGET = Some(x86_64-apple-darwin)
[INFO] [stderr]   CARGO_CFG_TARGET_FEATURE = Some(cmpxchg16b,fxsr,lahfsahf,sse,sse2,sse3,sse4.1,ssse3,x87)
[INFO] [stderr]   cargo:rerun-if-env-changed=MACOSX_DEPLOYMENT_TARGET
[INFO] [stderr]   MACOSX_DEPLOYMENT_TARGET = None
[INFO] [stderr]   HOST = Some(x86_64-unknown-linux-gnu)
[INFO] [stderr]   cargo:rerun-if-env-changed=CFLAGS_x86_64-apple-darwin
[INFO] [stderr]   CFLAGS_x86_64-apple-darwin = None
[INFO] [stderr]   cargo:rerun-if-env-changed=CFLAGS_x86_64_apple_darwin
[INFO] [stderr]   CFLAGS_x86_64_apple_darwin = None
[INFO] [stderr]   cargo:rerun-if-env-changed=TARGET_CFLAGS
[INFO] [stderr]   TARGET_CFLAGS = None
[INFO] [stderr]   cargo:rerun-if-env-changed=CFLAGS
[INFO] [stderr]   CFLAGS = None
[INFO] [stderr]   OUT_DIR = Some(/opt/rustwide/target/x86_64-apple-darwin/debug/build/zstd-sys-d1cb833694e3dd30/out)
[INFO] [stderr]   cargo:rerun-if-env-changed=CC_ENABLE_DEBUG_OUTPUT
[INFO] [stderr]   cargo:rerun-if-env-changed=CRATE_CC_NO_DEFAULTS
[INFO] [stderr]   CRATE_CC_NO_DEFAULTS = None
[INFO] [stderr]   TARGET = Some(x86_64-apple-darwin)
[INFO] [stderr]   CARGO_CFG_TARGET_FEATURE = Some(cmpxchg16b,fxsr,lahfsahf,sse,sse2,sse3,sse4.1,ssse3,x87)
[INFO] [stderr]   cargo:rerun-if-env-changed=MACOSX_DEPLOYMENT_TARGET
[INFO] [stderr]   MACOSX_DEPLOYMENT_TARGET = None
[INFO] [stderr]   HOST = Some(x86_64-unknown-linux-gnu)
[INFO] [stderr]   cargo:rerun-if-env-changed=CFLAGS_x86_64-apple-darwin
[INFO] [stderr]   CFLAGS_x86_64-apple-darwin = None
[INFO] [stderr]   cargo:rerun-if-env-changed=CFLAGS_x86_64_apple_darwin
[INFO] [stderr]   CFLAGS_x86_64_apple_darwin = None
[INFO] [stderr]   cargo:rerun-if-env-changed=TARGET_CFLAGS
[INFO] [stderr]   TARGET_CFLAGS = None
[INFO] [stderr]   cargo:rerun-if-env-changed=CFLAGS
[INFO] [stderr]   CFLAGS = None
[INFO] [stderr]   OUT_DIR = Some(/opt/rustwide/target/x86_64-apple-darwin/debug/build/zstd-sys-d1cb833694e3dd30/out)
[INFO] [stderr]   cargo:rerun-if-env-changed=CC_ENABLE_DEBUG_OUTPUT
[INFO] [stderr]   cargo:rerun-if-env-changed=CRATE_CC_NO_DEFAULTS
[INFO] [stderr]   CRATE_CC_NO_DEFAULTS = None
[INFO] [stderr]   TARGET = Some(x86_64-apple-darwin)
[INFO] [stderr]   CARGO_CFG_TARGET_FEATURE = Some(cmpxchg16b,fxsr,lahfsahf,sse,sse2,sse3,sse4.1,ssse3,x87)
[INFO] [stderr]   cargo:rerun-if-env-changed=MACOSX_DEPLOYMENT_TARGET
[INFO] [stderr]   MACOSX_DEPLOYMENT_TARGET = None
[INFO] [stderr]   HOST = Some(x86_64-unknown-linux-gnu)
[INFO] [stderr]   cargo:rerun-if-env-changed=CFLAGS_x86_64-apple-darwin
[INFO] [stderr]   CFLAGS_x86_64-apple-darwin = None
[INFO] [stderr]   cargo:rerun-if-env-changed=CFLAGS_x86_64_apple_darwin
[INFO] [stderr]   CFLAGS_x86_64_apple_darwin = None
[INFO] [stderr]   cargo:rerun-if-env-changed=TARGET_CFLAGS
[INFO] [stderr]   TARGET_CFLAGS = None
[INFO] [stderr]   cargo:rerun-if-env-changed=CFLAGS
[INFO] [stderr]   CFLAGS = None
[INFO] [stderr]   cargo:warning=cc: error: unrecognized command-line option '-arch'
[INFO] [stderr]   cargo:warning=cc: error: unrecognized command-line option '-mmacosx-version-min=10.7'
[INFO] [stderr]   exit status: 1
[INFO] [stderr]   cargo:warning=ToolExecError: Command LC_ALL="C" "cc" "-O0" "-ffunction-sections" "-fdata-sections" "-fPIC" "-gdwarf-2" "-fno-omit-frame-pointer" "-m64" "-arch" "x86_64" "-mmacosx-version-min=10.7" "-I" "zstd/lib/" "-I" "zstd/lib/common" "-fvisibility=hidden" "-DZSTD_LIB_DEPRECATED=0" "-DXXH_PRIVATE_API=" "-DZSTDLIB_VISIBILITY=" "-DZSTDERRORLIB_VISIBILITY=" "-o" "/opt/rustwide/target/x86_64-apple-darwin/debug/build/zstd-sys-d1cb833694e3dd30/out/44ff4c55aa9e5133-debug.o" "-c" "zstd/lib/common/debug.c" with args cc did not execute successfully (status code exit status: 1).cargo:warning=cc: error: unrecognized command-line option '-arch'
[INFO] [stderr]   cargo:warning=cc: error: unrecognized command-line option '-mmacosx-version-min=10.7'
[INFO] [stderr] 
[INFO] [stderr]   exit status: 1
[INFO] [stderr]   cargo:warning=ToolExecError: Command LC_ALL="C" "cc" "-O0" "-ffunction-sections" "-fdata-sections" "-fPIC" "-gdwarf-2" "-fno-omit-frame-pointer" "-m64" "-arch" "x86_64" "-mmacosx-version-min=10.7" "-I" "zstd/lib/" "-I" "zstd/lib/common" "-fvisibility=hidden" "-DZSTD_LIB_DEPRECATED=0" "-DXXH_PRIVATE_API=" "-DZSTDLIB_VISIBILITY=" "-DZSTDERRORLIB_VISIBILITY=" "-o" "/opt/rustwide/target/x86_64-apple-darwin/debug/build/zstd-sys-d1cb833694e3dd30/out/44ff4c55aa9e5133-entropy_common.o" "-c" "zstd/lib/common/entropy_common.c" with args cc did not execute successfully (status code exit status: 1).cargo:warning=cc: error: unrecognized command-line option '-arch'
[INFO] [stderr]   cargo:warning=cc: error: unrecognized command-line option '-mmacosx-version-min=10.7'
[INFO] [stderr] 
[INFO] [stderr]   exit status: 1
[INFO] [stderr]   cargo:warning=ToolExecError: Command LC_ALL="C" "cc" "-O0" "-ffunction-sections" "-fdata-sections" "-fPIC" "-gdwarf-2" "-fno-omit-frame-pointer" "-m64" "-arch" "x86_64" "-mmacosx-version-min=10.7" "-I" "zstd/lib/" "-I" "zstd/lib/common" "-fvisibility=hidden" "-DZSTD_LIB_DEPRECATED=0" "-DXXH_PRIVATE_API=" "-DZSTDLIB_VISIBILITY=" "-DZSTDERRORLIB_VISIBILITY=" "-o" "/opt/rustwide/target/x86_64-apple-darwin/debug/build/zstd-sys-d1cb833694e3dd30/out/44ff4c55aa9e5133-error_private.o" "-c" "zstd/lib/common/error_private.c" with args cc did not execute successfully (status code exit status: 1).cargo:warning=cc: error: unrecognized command-line option '-arch'
[INFO] [stderr]   cargo:warning=cc: error: unrecognized command-line option '-mmacosx-version-min=10.7'
[INFO] [stderr] 
[INFO] [stderr]   exit status: 1
[INFO] [stderr]   cargo:warning=ToolExecError: Command LC_ALL="C" "cc" "-O0" "-ffunction-sections" "-fdata-sections" "-fPIC" "-gdwarf-2" "-fno-omit-frame-pointer" "-m64" "-arch" "x86_64" "-mmacosx-version-min=10.7" "-I" "zstd/lib/" "-I" "zstd/lib/common" "-fvisibility=hidden" "-DZSTD_LIB_DEPRECATED=0" "-DXXH_PRIVATE_API=" "-DZSTDLIB_VISIBILITY=" "-DZSTDERRORLIB_VISIBILITY=" "-o" "/opt/rustwide/target/x86_64-apple-darwin/debug/build/zstd-sys-d1cb833694e3dd30/out/44ff4c55aa9e5133-fse_decompress.o" "-c" "zstd/lib/common/fse_decompress.c" with args cc did not execute successfully (status code exit status: 1).cargo:warning=cc: error: unrecognized command-line option '-arch'
[INFO] [stderr]   cargo:warning=cc: error: unrecognized command-line option '-mmacosx-version-min=10.7'
[INFO] [stderr] 
[INFO] [stderr]   exit status: 1
[INFO] [stderr]   cargo:warning=ToolExecError: Command LC_ALL="C" "cc" "-O0" "-ffunction-sections" "-fdata-sections" "-fPIC" "-gdwarf-2" "-fno-omit-frame-pointer" "-m64" "-arch" "x86_64" "-mmacosx-version-min=10.7" "-I" "zstd/lib/" "-I" "zstd/lib/common" "-fvisibility=hidden" "-DZSTD_LIB_DEPRECATED=0" "-DXXH_PRIVATE_API=" "-DZSTDLIB_VISIBILITY=" "-DZSTDERRORLIB_VISIBILITY=" "-o" "/opt/rustwide/target/x86_64-apple-darwin/debug/build/zstd-sys-d1cb833694e3dd30/out/44ff4c55aa9e5133-pool.o" "-c" "zstd/lib/common/pool.c" with args cc did not execute successfully (status code exit status: 1).cargo:warning=cc: error: unrecognized command-line option '-arch'
[INFO] [stderr]   cargo:warning=cc: error: unrecognized command-line option '-mmacosx-version-min=10.7'
[INFO] [stderr] 
[INFO] [stderr]   exit status: 1
[INFO] [stderr]   cargo:warning=ToolExecError: Command LC_ALL="C" "cc" "-O0" "-ffunction-sections" "-fdata-sections" "-fPIC" "-gdwarf-2" "-fno-omit-frame-pointer" "-m64" "-arch" "x86_64" "-mmacosx-version-min=10.7" "-I" "zstd/lib/" "-I" "zstd/lib/common" "-fvisibility=hidden" "-DZSTD_LIB_DEPRECATED=0" "-DXXH_PRIVATE_API=" "-DZSTDLIB_VISIBILITY=" "-DZSTDERRORLIB_VISIBILITY=" "-o" "/opt/rustwide/target/x86_64-apple-darwin/debug/build/zstd-sys-d1cb833694e3dd30/out/44ff4c55aa9e5133-threading.o" "-c" "zstd/lib/common/threading.c" with args cc did not execute successfully (status code exit status: 1).cargo:warning=cc: error: unrecognized command-line option '-arch'
[INFO] [stderr]   cargo:warning=cc: error: unrecognized command-line option '-mmacosx-version-min=10.7'
[INFO] [stderr] 
[INFO] [stderr]   exit status: 1
[INFO] [stderr]   cargo:warning=ToolExecError: Command LC_ALL="C" "cc" "-O0" "-ffunction-sections" "-fdata-sections" "-fPIC" "-gdwarf-2" "-fno-omit-frame-pointer" "-m64" "-arch" "x86_64" "-mmacosx-version-min=10.7" "-I" "zstd/lib/" "-I" "zstd/lib/common" "-fvisibility=hidden" "-DZSTD_LIB_DEPRECATED=0" "-DXXH_PRIVATE_API=" "-DZSTDLIB_VISIBILITY=" "-DZSTDERRORLIB_VISIBILITY=" "-o" "/opt/rustwide/target/x86_64-apple-darwin/debug/build/zstd-sys-d1cb833694e3dd30/out/44ff4c55aa9e5133-zstd_common.o" "-c" "zstd/lib/common/zstd_common.c" with args cc did not execute successfully (status code exit status: 1).cargo:warning=cc: error: unrecognized command-line option '-arch'
[INFO] [stderr]   cargo:warning=cc: error: unrecognized command-line option '-mmacosx-version-min=10.7'
[INFO] [stderr] 
[INFO] [stderr]   exit status: 1
[INFO] [stderr]   cargo:warning=ToolExecError: Command LC_ALL="C" "cc" "-O0" "-ffunction-sections" "-fdata-sections" "-fPIC" "-gdwarf-2" "-fno-omit-frame-pointer" "-m64" "-arch" "x86_64" "-mmacosx-version-min=10.7" "-I" "zstd/lib/" "-I" "zstd/lib/common" "-fvisibility=hidden" "-DZSTD_LIB_DEPRECATED=0" "-DXXH_PRIVATE_API=" "-DZSTDLIB_VISIBILITY=" "-DZSTDERRORLIB_VISIBILITY=" "-o" "/opt/rustwide/target/x86_64-apple-darwin/debug/build/zstd-sys-d1cb833694e3dd30/out/fb80479a5fb81f6a-fse_compress.o" "-c" "zstd/lib/compress/fse_compress.c" with args cc did not execute successfully (status code exit status: 1).cargo:warning=cc: error: unrecognized command-line option '-arch'
[INFO] [stderr]   cargo:warning=cc: error: unrecognized command-line option '-mmacosx-version-min=10.7'
[INFO] [stderr] 
[INFO] [stderr]   exit status: 1
[INFO] [stderr]   cargo:warning=ToolExecError: Command LC_ALL="C" "cc" "-O0" "-ffunction-sections" "-fdata-sections" "-fPIC" "-gdwarf-2" "-fno-omit-frame-pointer" "-m64" "-arch" "x86_64" "-mmacosx-version-min=10.7" "-I" "zstd/lib/" "-I" "zstd/lib/common" "-fvisibility=hidden" "-DZSTD_LIB_DEPRECATED=0" "-DXXH_PRIVATE_API=" "-DZSTDLIB_VISIBILITY=" "-DZSTDERRORLIB_VISIBILITY=" "-o" "/opt/rustwide/target/x86_64-apple-darwin/debug/build/zstd-sys-d1cb833694e3dd30/out/fb80479a5fb81f6a-hist.o" "-c" "zstd/lib/compress/hist.c" with args cc did not execute successfully (status code exit status: 1).cargo:warning=cc: error: unrecognized command-line option '-arch'
[INFO] [stderr]   cargo:warning=cc: error: unrecognized command-line option '-mmacosx-version-min=10.7'
[INFO] [stderr] 
[INFO] [stderr]   exit status: 1
[INFO] [stderr]   cargo:warning=ToolExecError: Command LC_ALL="C" "cc" "-O0" "-ffunction-sections" "-fdata-sections" "-fPIC" "-gdwarf-2" "-fno-omit-frame-pointer" "-m64" "-arch" "x86_64" "-mmacosx-version-min=10.7" "-I" "zstd/lib/" "-I" "zstd/lib/common" "-fvisibility=hidden" "-DZSTD_LIB_DEPRECATED=0" "-DXXH_PRIVATE_API=" "-DZSTDLIB_VISIBILITY=" "-DZSTDERRORLIB_VISIBILITY=" "-o" "/opt/rustwide/target/x86_64-apple-darwin/debug/build/zstd-sys-d1cb833694e3dd30/out/fb80479a5fb81f6a-huf_compress.o" "-c" "zstd/lib/compress/huf_compress.c" with args cc did not execute successfully (status code exit status: 1).cargo:warning=cc: error: unrecognized command-line option '-arch'
[INFO] [stderr]   cargo:warning=cc: error: unrecognized command-line option '-mmacosx-version-min=10.7'
[INFO] [stderr] 
[INFO] [stderr]   exit status: 1
[INFO] [stderr]   cargo:warning=ToolExecError: Command LC_ALL="C" "cc" "-O0" "-ffunction-sections" "-fdata-sections" "-fPIC" "-gdwarf-2" "-fno-omit-frame-pointer" "-m64" "-arch" "x86_64" "-mmacosx-version-min=10.7" "-I" "zstd/lib/" "-I" "zstd/lib/common" "-fvisibility=hidden" "-DZSTD_LIB_DEPRECATED=0" "-DXXH_PRIVATE_API=" "-DZSTDLIB_VISIBILITY=" "-DZSTDERRORLIB_VISIBILITY=" "-o" "/opt/rustwide/target/x86_64-apple-darwin/debug/build/zstd-sys-d1cb833694e3dd30/out/fb80479a5fb81f6a-zstd_compress.o" "-c" "zstd/lib/compress/zstd_compress.c" with args cc did not execute successfully (status code exit status: 1).cargo:warning=cc: error: unrecognized command-line option '-arch'
[INFO] [stderr]   cargo:warning=cc: error: unrecognized command-line option '-mmacosx-version-min=10.7'
[INFO] [stderr] 
[INFO] [stderr]   exit status: 1
[INFO] [stderr]   cargo:warning=ToolExecError: Command LC_ALL="C" "cc" "-O0" "-ffunction-sections" "-fdata-sections" "-fPIC" "-gdwarf-2" "-fno-omit-frame-pointer" "-m64" "-arch" "x86_64" "-mmacosx-version-min=10.7" "-I" "zstd/lib/" "-I" "zstd/lib/common" "-fvisibility=hidden" "-DZSTD_LIB_DEPRECATED=0" "-DXXH_PRIVATE_API=" "-DZSTDLIB_VISIBILITY=" "-DZSTDERRORLIB_VISIBILITY=" "-o" "/opt/rustwide/target/x86_64-apple-darwin/debug/build/zstd-sys-d1cb833694e3dd30/out/fb80479a5fb81f6a-zstd_compress_literals.o" "-c" "zstd/lib/compress/zstd_compress_literals.c" with args cc did not execute successfully (status code exit status: 1).cargo:warning=cc: error: unrecognized command-line option '-arch'
[INFO] [stderr]   cargo:warning=cc: error: unrecognized command-line option '-mmacosx-version-min=10.7'
[INFO] [stderr] 
[INFO] [stderr]   exit status: 1
[INFO] [stderr]   cargo:warning=ToolExecError: Command LC_ALL="C" "cc" "-O0" "-ffunction-sections" "-fdata-sections" "-fPIC" "-gdwarf-2" "-fno-omit-frame-pointer" "-m64" "-arch" "x86_64" "-mmacosx-version-min=10.7" "-I" "zstd/lib/" "-I" "zstd/lib/common" "-fvisibility=hidden" "-DZSTD_LIB_DEPRECATED=0" "-DXXH_PRIVATE_API=" "-DZSTDLIB_VISIBILITY=" "-DZSTDERRORLIB_VISIBILITY=" "-o" "/opt/rustwide/target/x86_64-apple-darwin/debug/build/zstd-sys-d1cb833694e3dd30/out/fb80479a5fb81f6a-zstd_compress_sequences.o" "-c" "zstd/lib/compress/zstd_compress_sequences.c" with args cc did not execute successfully (status code exit status: 1).cargo:warning=cc: error: unrecognized command-line option '-arch'
[INFO] [stderr]   cargo:warning=cc: error: unrecognized command-line option '-mmacosx-version-min=10.7'
[INFO] [stderr] 
[INFO] [stderr]   exit status: 1
[INFO] [stderr]   cargo:warning=ToolExecError: Command LC_ALL="C" "cc" "-O0" "-ffunction-sections" "-fdata-sections" "-fPIC" "-gdwarf-2" "-fno-omit-frame-pointer" "-m64" "-arch" "x86_64" "-mmacosx-version-min=10.7" "-I" "zstd/lib/" "-I" "zstd/lib/common" "-fvisibility=hidden" "-DZSTD_LIB_DEPRECATED=0" "-DXXH_PRIVATE_API=" "-DZSTDLIB_VISIBILITY=" "-DZSTDERRORLIB_VISIBILITY=" "-o" "/opt/rustwide/target/x86_64-apple-darwin/debug/build/zstd-sys-d1cb833694e3dd30/out/fb80479a5fb81f6a-zstd_compress_superblock.o" "-c" "zstd/lib/compress/zstd_compress_superblock.c" with args cc did not execute successfully (status code exit status: 1).cargo:warning=cc: error: unrecognized command-line option '-arch'
[INFO] [stderr]   cargo:warning=cc: error: unrecognized command-line option '-mmacosx-version-min=10.7'
[INFO] [stderr] 
[INFO] [stderr]   exit status: 1
[INFO] [stderr]   cargo:warning=ToolExecError: Command LC_ALL="C" "cc" "-O0" "-ffunction-sections" "-fdata-sections" "-fPIC" "-gdwarf-2" "-fno-omit-frame-pointer" "-m64" "-arch" "x86_64" "-mmacosx-version-min=10.7" "-I" "zstd/lib/" "-I" "zstd/lib/common" "-fvisibility=hidden" "-DZSTD_LIB_DEPRECATED=0" "-DXXH_PRIVATE_API=" "-DZSTDLIB_VISIBILITY=" "-DZSTDERRORLIB_VISIBILITY=" "-o" "/opt/rustwide/target/x86_64-apple-darwin/debug/build/zstd-sys-d1cb833694e3dd30/out/fb80479a5fb81f6a-zstd_double_fast.o" "-c" "zstd/lib/compress/zstd_double_fast.c" with args cc did not execute successfully (status code exit status: 1).cargo:warning=cc: error: unrecognized command-line option '-arch'
[INFO] [stderr]   cargo:warning=cc: error: unrecognized command-line option '-mmacosx-version-min=10.7'
[INFO] [stderr] 
[INFO] [stderr]   exit status: 1
[INFO] [stderr]   cargo:warning=ToolExecError: Command LC_ALL="C" "cc" "-O0" "-ffunction-sections" "-fdata-sections" "-fPIC" "-gdwarf-2" "-fno-omit-frame-pointer" "-m64" "-arch" "x86_64" "-mmacosx-version-min=10.7" "-I" "zstd/lib/" "-I" "zstd/lib/common" "-fvisibility=hidden" "-DZSTD_LIB_DEPRECATED=0" "-DXXH_PRIVATE_API=" "-DZSTDLIB_VISIBILITY=" "-DZSTDERRORLIB_VISIBILITY=" "-o" "/opt/rustwide/target/x86_64-apple-darwin/debug/build/zstd-sys-d1cb833694e3dd30/out/fb80479a5fb81f6a-zstd_fast.o" "-c" "zstd/lib/compress/zstd_fast.c" with args cc did not execute successfully (status code exit status: 1).cargo:warning=cc: error: unrecognized command-line option '-arch'
[INFO] [stderr]   cargo:warning=cc: error: unrecognized command-line option '-mmacosx-version-min=10.7'
[INFO] [stderr] 
[INFO] [stderr]   exit status: 1
[INFO] [stderr]   cargo:warning=ToolExecError: Command LC_ALL="C" "cc" "-O0" "-ffunction-sections" "-fdata-sections" "-fPIC" "-gdwarf-2" "-fno-omit-frame-pointer" "-m64" "-arch" "x86_64" "-mmacosx-version-min=10.7" "-I" "zstd/lib/" "-I" "zstd/lib/common" "-fvisibility=hidden" "-DZSTD_LIB_DEPRECATED=0" "-DXXH_PRIVATE_API=" "-DZSTDLIB_VISIBILITY=" "-DZSTDERRORLIB_VISIBILITY=" "-o" "/opt/rustwide/target/x86_64-apple-darwin/debug/build/zstd-sys-d1cb833694e3dd30/out/fb80479a5fb81f6a-zstd_lazy.o" "-c" "zstd/lib/compress/zstd_lazy.c" with args cc did not execute successfully (status code exit status: 1).cargo:warning=cc: error: unrecognized command-line option '-arch'
[INFO] [stderr]   cargo:warning=cc: error: unrecognized command-line option '-mmacosx-version-min=10.7'
[INFO] [stderr] 
[INFO] [stderr]   exit status: 1
[INFO] [stderr]   cargo:warning=ToolExecError: Command LC_ALL="C" "cc" "-O0" "-ffunction-sections" "-fdata-sections" "-fPIC" "-gdwarf-2" "-fno-omit-frame-pointer" "-m64" "-arch" "x86_64" "-mmacosx-version-min=10.7" "-I" "zstd/lib/" "-I" "zstd/lib/common" "-fvisibility=hidden" "-DZSTD_LIB_DEPRECATED=0" "-DXXH_PRIVATE_API=" "-DZSTDLIB_VISIBILITY=" "-DZSTDERRORLIB_VISIBILITY=" "-o" "/opt/rustwide/target/x86_64-apple-darwin/debug/build/zstd-sys-d1cb833694e3dd30/out/fb80479a5fb81f6a-zstd_ldm.o" "-c" "zstd/lib/compress/zstd_ldm.c" with args cc did not execute successfully (status code exit status: 1).cargo:warning=cc: error: unrecognized command-line option '-arch'
[INFO] [stderr]   cargo:warning=cc: error: unrecognized command-line option '-mmacosx-version-min=10.7'
[INFO] [stderr] 
[INFO] [stderr]   exit status: 1
[INFO] [stderr]   cargo:warning=ToolExecError: Command LC_ALL="C" "cc" "-O0" "-ffunction-sections" "-fdata-sections" "-fPIC" "-gdwarf-2" "-fno-omit-frame-pointer" "-m64" "-arch" "x86_64" "-mmacosx-version-min=10.7" "-I" "zstd/lib/" "-I" "zstd/lib/common" "-fvisibility=hidden" "-DZSTD_LIB_DEPRECATED=0" "-DXXH_PRIVATE_API=" "-DZSTDLIB_VISIBILITY=" "-DZSTDERRORLIB_VISIBILITY=" "-o" "/opt/rustwide/target/x86_64-apple-darwin/debug/build/zstd-sys-d1cb833694e3dd30/out/fb80479a5fb81f6a-zstd_opt.o" "-c" "zstd/lib/compress/zstd_opt.c" with args cc did not execute successfully (status code exit status: 1).cargo:warning=cc: error: unrecognized command-line option '-arch'
[INFO] [stderr]   cargo:warning=cc: error: unrecognized command-line option '-mmacosx-version-min=10.7'
[INFO] [stderr] 
[INFO] [stderr]   exit status: 1
[INFO] [stderr]   cargo:warning=ToolExecError: Command LC_ALL="C" "cc" "-O0" "-ffunction-sections" "-fdata-sections" "-fPIC" "-gdwarf-2" "-fno-omit-frame-pointer" "-m64" "-arch" "x86_64" "-mmacosx-version-min=10.7" "-I" "zstd/lib/" "-I" "zstd/lib/common" "-fvisibility=hidden" "-DZSTD_LIB_DEPRECATED=0" "-DXXH_PRIVATE_API=" "-DZSTDLIB_VISIBILITY=" "-DZSTDERRORLIB_VISIBILITY=" "-o" "/opt/rustwide/target/x86_64-apple-darwin/debug/build/zstd-sys-d1cb833694e3dd30/out/fb80479a5fb81f6a-zstdmt_compress.o" "-c" "zstd/lib/compress/zstdmt_compress.c" with args cc did not execute successfully (status code exit status: 1).cargo:warning=cc: error: unrecognized command-line option '-arch'
[INFO] [stderr]   cargo:warning=cc: error: unrecognized command-line option '-mmacosx-version-min=10.7'
[INFO] [stderr] 
[INFO] [stderr]   exit status: 1
[INFO] [stderr]   cargo:warning=ToolExecError: Command LC_ALL="C" "cc" "-O0" "-ffunction-sections" "-fdata-sections" "-fPIC" "-gdwarf-2" "-fno-omit-frame-pointer" "-m64" "-arch" "x86_64" "-mmacosx-version-min=10.7" "-I" "zstd/lib/" "-I" "zstd/lib/common" "-fvisibility=hidden" "-DZSTD_LIB_DEPRECATED=0" "-DXXH_PRIVATE_API=" "-DZSTDLIB_VISIBILITY=" "-DZSTDERRORLIB_VISIBILITY=" "-o" "/opt/rustwide/target/x86_64-apple-darwin/debug/build/zstd-sys-d1cb833694e3dd30/out/88f362f13b0528ed-huf_decompress.o" "-c" "zstd/lib/decompress/huf_decompress.c" with args cc did not execute successfully (status code exit status: 1).cargo:warning=cc: error: unrecognized command-line option '-arch'
[INFO] [stderr]   cargo:warning=cc: error: unrecognized command-line option '-mmacosx-version-min=10.7'
[INFO] [stderr] 
[INFO] [stderr]   exit status: 1
[INFO] [stderr]   cargo:warning=ToolExecError: Command LC_ALL="C" "cc" "-O0" "-ffunction-sections" "-fdata-sections" "-fPIC" "-gdwarf-2" "-fno-omit-frame-pointer" "-m64" "-arch" "x86_64" "-mmacosx-version-min=10.7" "-I" "zstd/lib/" "-I" "zstd/lib/common" "-fvisibility=hidden" "-DZSTD_LIB_DEPRECATED=0" "-DXXH_PRIVATE_API=" "-DZSTDLIB_VISIBILITY=" "-DZSTDERRORLIB_VISIBILITY=" "-o" "/opt/rustwide/target/x86_64-apple-darwin/debug/build/zstd-sys-d1cb833694e3dd30/out/88f362f13b0528ed-zstd_ddict.o" "-c" "zstd/lib/decompress/zstd_ddict.c" with args cc did not execute successfully (status code exit status: 1).cargo:warning=cc: error: unrecognized command-line option '-arch'
[INFO] [stderr]   cargo:warning=cc: error: unrecognized command-line option '-mmacosx-version-min=10.7'
[INFO] [stderr] 
[INFO] [stderr]   exit status: 1
[INFO] [stderr]   cargo:warning=ToolExecError: Command LC_ALL="C" "cc" "-O0" "-ffunction-sections" "-fdata-sections" "-fPIC" "-gdwarf-2" "-fno-omit-frame-pointer" "-m64" "-arch" "x86_64" "-mmacosx-version-min=10.7" "-I" "zstd/lib/" "-I" "zstd/lib/common" "-fvisibility=hidden" "-DZSTD_LIB_DEPRECATED=0" "-DXXH_PRIVATE_API=" "-DZSTDLIB_VISIBILITY=" "-DZSTDERRORLIB_VISIBILITY=" "-o" "/opt/rustwide/target/x86_64-apple-darwin/debug/build/zstd-sys-d1cb833694e3dd30/out/88f362f13b0528ed-zstd_decompress.o" "-c" "zstd/lib/decompress/zstd_decompress.c" with args cc did not execute successfully (status code exit status: 1).cargo:warning=cc: error: unrecognized command-line option '-arch'
[INFO] [stderr]   cargo:warning=cc: error: unrecognized command-line option '-mmacosx-version-min=10.7'
[INFO] [stderr] 
[INFO] [stderr]   exit status: 1
[INFO] [stderr]   cargo:warning=ToolExecError: Command LC_ALL="C" "cc" "-O0" "-ffunction-sections" "-fdata-sections" "-fPIC" "-gdwarf-2" "-fno-omit-frame-pointer" "-m64" "-arch" "x86_64" "-mmacosx-version-min=10.7" "-I" "zstd/lib/" "-I" "zstd/lib/common" "-fvisibility=hidden" "-DZSTD_LIB_DEPRECATED=0" "-DXXH_PRIVATE_API=" "-DZSTDLIB_VISIBILITY=" "-DZSTDERRORLIB_VISIBILITY=" "-o" "/opt/rustwide/target/x86_64-apple-darwin/debug/build/zstd-sys-d1cb833694e3dd30/out/88f362f13b0528ed-zstd_decompress_block.o" "-c" "zstd/lib/decompress/zstd_decompress_block.c" with args cc did not execute successfully (status code exit status: 1).cargo:warning=cc: error: unrecognized command-line option '-arch'
[INFO] [stderr]   cargo:warning=cc: error: unrecognized command-line option '-mmacosx-version-min=10.7'
[INFO] [stderr] 
[INFO] [stderr]   exit status: 1
[INFO] [stderr]   cargo:warning=ToolExecError: Command LC_ALL="C" "cc" "-O0" "-ffunction-sections" "-fdata-sections" "-fPIC" "-gdwarf-2" "-fno-omit-frame-pointer" "-m64" "-arch" "x86_64" "-mmacosx-version-min=10.7" "-I" "zstd/lib/" "-I" "zstd/lib/common" "-fvisibility=hidden" "-DZSTD_LIB_DEPRECATED=0" "-DXXH_PRIVATE_API=" "-DZSTDLIB_VISIBILITY=" "-DZSTDERRORLIB_VISIBILITY=" "-o" "/opt/rustwide/target/x86_64-apple-darwin/debug/build/zstd-sys-d1cb833694e3dd30/out/7faed3f8272f2313-huf_decompress_amd64.o" "-c" "zstd/lib/decompress/huf_decompress_amd64.S" with args cc did not execute successfully (status code exit status: 1).
[INFO] [stderr] 
[INFO] [stderr]   --- stderr
[INFO] [stderr] 
[INFO] [stderr] 
[INFO] [stderr]   error occurred in cc-rs: Command LC_ALL="C" "cc" "-O0" "-ffunction-sections" "-fdata-sections" "-fPIC" "-gdwarf-2" "-fno-omit-frame-pointer" "-m64" "-arch" "x86_64" "-mmacosx-version-min=10.7" "-I" "zstd/lib/" "-I" "zstd/lib/common" "-fvisibility=hidden" "-DZSTD_LIB_DEPRECATED=0" "-DXXH_PRIVATE_API=" "-DZSTDLIB_VISIBILITY=" "-DZSTDERRORLIB_VISIBILITY=" "-o" "/opt/rustwide/target/x86_64-apple-darwin/debug/build/zstd-sys-d1cb833694e3dd30/out/7faed3f8272f2313-huf_decompress_amd64.o" "-c" "zstd/lib/decompress/huf_decompress_amd64.S" with args cc did not execute successfully (status code exit status: 1).
[INFO] [stderr] 
[INFO] [stderr] 
[INFO] running `Command { std: "docker" "inspect" "365e1aaf17f964a843e5fbe89b9619df8f1966841f02368cbd6b832e8fec169e", kill_on_drop: false }`
[INFO] running `Command { std: "docker" "rm" "-f" "365e1aaf17f964a843e5fbe89b9619df8f1966841f02368cbd6b832e8fec169e", kill_on_drop: false }`
[INFO] [stdout] 365e1aaf17f964a843e5fbe89b9619df8f1966841f02368cbd6b832e8fec169e