leptos_actix 0.6.15

Actix integrations for the Leptos web framework.
Documentation
Build #1351807 2024-09-08T00:28:30.693124+00:00
# rustc version
rustc 1.83.0-nightly (26b5599e4 2024-09-06)# docs.rs version
docsrs 0.6.0 (a6155e2c 2024-08-13)# build log
[INFO] running `Command { std: "docker" "create" "-v" "/home/cratesfyi/workspace-builder/builds/leptos_actix-0.6.15/target:/opt/rustwide/target:rw,Z" "-v" "/home/cratesfyi/workspace-builder/builds/leptos_actix-0.6.15/source:/opt/rustwide/workdir:ro,Z" "-v" "/home/cratesfyi/workspace-builder/cargo-home:/opt/rustwide/cargo-home:ro,Z" "-v" "/home/cratesfyi/workspace-builder/rustup-home:/opt/rustwide/rustup-home:ro,Z" "-e" "SOURCE_DIR=/opt/rustwide/workdir" "-e" "CARGO_TARGET_DIR=/opt/rustwide/target" "-e" "DOCS_RS=1" "-e" "CARGO_HOME=/opt/rustwide/cargo-home" "-e" "RUSTUP_HOME=/opt/rustwide/rustup-home" "-w" "/opt/rustwide/workdir" "-m" "6442450944" "--cpus" "6" "--user" "1001:1001" "--network" "none" "ghcr.io/rust-lang/crates-build-env/linux@sha256:96c0aa5895ecf336b730ef27bcdde6e21027415df19888aad3cf1448e5d65d90" "/opt/rustwide/cargo-home/bin/cargo" "+nightly" "rustdoc" "--lib" "-Zrustdoc-map" "--config" "build.rustdocflags=[\"--cfg\", \"docsrs\", \"--generate-link-to-definition\", \"-Z\", \"unstable-options\", \"--emit=invocation-specific\", \"--resource-suffix\", \"-20240906-1.83.0-nightly-26b5599e4\", \"--static-root-path\", \"/-/rustdoc.static/\", \"--cap-lints\", \"warn\", \"--extern-html-root-takes-precedence\"]" "--offline" "-Zunstable-options" "--config=doc.extern-map.registries.crates-io=\"https://docs.rs/{pkg_name}/{version}/x86_64-apple-darwin\"" "-Zrustdoc-scrape-examples" "-j6" "--target" "x86_64-apple-darwin", kill_on_drop: false }`
[INFO] [stderr] WARNING: Your kernel does not support swap limit capabilities or the cgroup is not mounted. Memory limited without swap.
[INFO] [stdout] e5059285da04a56c30da9d7442f7ca0905b5538475d9bad6e90a7b5c8cba5228
[INFO] running `Command { std: "docker" "start" "-a" "e5059285da04a56c30da9d7442f7ca0905b5538475d9bad6e90a7b5c8cba5228", kill_on_drop: false }`
[INFO] [stderr] warning: target filter specified, but no targets matched; this is a no-op
[INFO] [stderr]    Compiling zstd-sys v2.0.13+zstd.1.5.6
[INFO] [stderr]    Compiling cookie v0.16.2
[INFO] [stderr]     Checking pin-project v1.1.5
[INFO] [stderr]     Checking httparse v1.9.4
[INFO] [stderr]     Checking rand v0.8.5
[INFO] [stderr]     Checking h2 v0.3.26
[INFO] [stderr]     Checking local-channel v0.1.5
[INFO] [stderr]     Checking wasm-bindgen-futures v0.4.43
[INFO] [stderr]     Checking futures-executor v0.3.30
[INFO] [stderr]     Checking encoding_rs v0.8.34
[INFO] [stderr]     Checking half v2.4.1
[INFO] [stderr]     Checking language-tags v0.3.2
[INFO] [stderr]     Checking mime v0.3.17
[INFO] [stderr]     Checking httpdate v1.0.3
[INFO] [stderr]     Checking regex-lite v0.1.6
[INFO] [stderr]     Checking ciborium-io v0.2.2
[INFO] [stderr]     Checking ciborium-ll v0.2.2
[INFO] [stderr]     Checking futures v0.3.30
[INFO] [stderr]    Compiling slotmap v1.0.7
[INFO] [stderr]     Checking url v2.5.2
[INFO] [stderr]     Checking actix-router v0.5.3
[INFO] [stderr]     Checking actix-server v2.5.0
[INFO] [stderr]     Checking gloo-utils v0.2.0
[INFO] [stderr]     Checking serde_urlencoded v0.7.1
[INFO] [stderr]     Checking http v1.1.0
[INFO] [stderr]     Checking serde_spanned v0.6.7
[INFO] [stderr]     Checking toml_datetime v0.6.8
[INFO] [stderr]    Compiling proc-macro2 v1.0.86
[INFO] [stderr]     Checking unicode-ident v1.0.12
[INFO] [stderr]     Checking impl-more v0.1.6
[INFO] [stderr]     Checking winnow v0.6.18
[INFO] [stderr]     Checking ciborium v0.2.2
[INFO] [stderr]     Checking gloo-net v0.6.0
[INFO] [stderr]     Checking wasm-streams v0.4.0
[INFO] [stderr]     Checking const_format v0.2.33
[INFO] [stderr]     Checking serde-wasm-bindgen v0.6.5
[INFO] [stderr]     Checking serde_qs v0.12.0
[INFO] [stderr]     Checking oco_ref v0.1.1
[INFO] [stderr]     Checking dashmap v5.5.3
[INFO] [stderr]     Checking send_wrapper v0.6.0
[INFO] [stderr]     Checking inventory v0.3.15
[INFO] [stderr]     Checking xxhash-rust v0.8.12
[INFO] [stderr]     Checking self_cell v1.0.4
[INFO] [stderr]     Checking unicode-segmentation v1.11.0
[INFO] [stderr]     Checking rustc-hash v1.1.0
[INFO] [stderr]     Checking lazy_static v1.5.0
[INFO] [stderr]     Checking minimal-lexical v0.2.1
[INFO] [stderr]     Checking leptos_reactive v0.6.15
[INFO] [stderr]     Checking nom v7.1.3
[INFO] [stderr]     Checking convert_case v0.6.0
[INFO] [stderr]     Checking quote v1.0.37
[INFO] [stderr]     Checking toml_edit v0.22.20
[INFO] [stderr]     Checking utf8-width v0.1.7
[INFO] [stderr]     Checking either v1.13.0
[INFO] [stderr]     Checking pathdiff v0.2.1
[INFO] [stderr]     Checking itertools v0.12.1
[INFO] [stderr]     Checking html-escape v0.2.13
[INFO] [stderr] The following warnings were emitted during compilation:
[INFO] [stderr] 
[INFO] [stderr] warning: zstd-sys@2.0.13+zstd.1.5.6: cc: error: unrecognized command-line option '-arch'
[INFO] [stderr] warning: zstd-sys@2.0.13+zstd.1.5.6: cc: error: unrecognized command-line option '-mmacosx-version-min=10.7'
[INFO] [stderr] warning: zstd-sys@2.0.13+zstd.1.5.6: ToolExecError: Command "cc" "-O0" "-ffunction-sections" "-fdata-sections" "-fPIC" "-gdwarf-2" "-fno-omit-frame-pointer" "-m64" "-arch" "x86_64" "-mmacosx-version-min=10.7" "-I" "zstd/lib/" "-I" "zstd/lib/common" "-I" "zstd/lib/legacy" "-fvisibility=hidden" "-DZSTD_LIB_DEPRECATED=0" "-DXXH_PRIVATE_API=" "-DZSTDLIB_VISIBILITY=" "-DZDICTLIB_VISIBILITY=" "-DZSTDERRORLIB_VISIBILITY=" "-DZSTD_LEGACY_SUPPORT=1" "-o" "/opt/rustwide/target/x86_64-apple-darwin/debug/build/zstd-sys-d331e80d5a56560e/out/8957a4c8b028b07b-debug.o" "-c" "zstd/lib/common/debug.c" with args cc did not execute successfully (status code exit status: 1).cargo:warning=cc: error: unrecognized command-line option '-arch'
[INFO] [stderr] warning: zstd-sys@2.0.13+zstd.1.5.6: cc: error: unrecognized command-line option '-mmacosx-version-min=10.7'
[INFO] [stderr] warning: zstd-sys@2.0.13+zstd.1.5.6: ToolExecError: Command "cc" "-O0" "-ffunction-sections" "-fdata-sections" "-fPIC" "-gdwarf-2" "-fno-omit-frame-pointer" "-m64" "-arch" "x86_64" "-mmacosx-version-min=10.7" "-I" "zstd/lib/" "-I" "zstd/lib/common" "-I" "zstd/lib/legacy" "-fvisibility=hidden" "-DZSTD_LIB_DEPRECATED=0" "-DXXH_PRIVATE_API=" "-DZSTDLIB_VISIBILITY=" "-DZDICTLIB_VISIBILITY=" "-DZSTDERRORLIB_VISIBILITY=" "-DZSTD_LEGACY_SUPPORT=1" "-o" "/opt/rustwide/target/x86_64-apple-darwin/debug/build/zstd-sys-d331e80d5a56560e/out/8957a4c8b028b07b-entropy_common.o" "-c" "zstd/lib/common/entropy_common.c" with args cc did not execute successfully (status code exit status: 1).cargo:warning=cc: error: unrecognized command-line option '-arch'
[INFO] [stderr] warning: zstd-sys@2.0.13+zstd.1.5.6: cc: error: unrecognized command-line option '-mmacosx-version-min=10.7'
[INFO] [stderr] warning: zstd-sys@2.0.13+zstd.1.5.6: ToolExecError: Command "cc" "-O0" "-ffunction-sections" "-fdata-sections" "-fPIC" "-gdwarf-2" "-fno-omit-frame-pointer" "-m64" "-arch" "x86_64" "-mmacosx-version-min=10.7" "-I" "zstd/lib/" "-I" "zstd/lib/common" "-I" "zstd/lib/legacy" "-fvisibility=hidden" "-DZSTD_LIB_DEPRECATED=0" "-DXXH_PRIVATE_API=" "-DZSTDLIB_VISIBILITY=" "-DZDICTLIB_VISIBILITY=" "-DZSTDERRORLIB_VISIBILITY=" "-DZSTD_LEGACY_SUPPORT=1" "-o" "/opt/rustwide/target/x86_64-apple-darwin/debug/build/zstd-sys-d331e80d5a56560e/out/8957a4c8b028b07b-error_private.o" "-c" "zstd/lib/common/error_private.c" with args cc did not execute successfully (status code exit status: 1).cargo:warning=cc: error: unrecognized command-line option '-arch'
[INFO] [stderr] warning: zstd-sys@2.0.13+zstd.1.5.6: cc: error: unrecognized command-line option '-mmacosx-version-min=10.7'
[INFO] [stderr] warning: zstd-sys@2.0.13+zstd.1.5.6: ToolExecError: Command "cc" "-O0" "-ffunction-sections" "-fdata-sections" "-fPIC" "-gdwarf-2" "-fno-omit-frame-pointer" "-m64" "-arch" "x86_64" "-mmacosx-version-min=10.7" "-I" "zstd/lib/" "-I" "zstd/lib/common" "-I" "zstd/lib/legacy" "-fvisibility=hidden" "-DZSTD_LIB_DEPRECATED=0" "-DXXH_PRIVATE_API=" "-DZSTDLIB_VISIBILITY=" "-DZDICTLIB_VISIBILITY=" "-DZSTDERRORLIB_VISIBILITY=" "-DZSTD_LEGACY_SUPPORT=1" "-o" "/opt/rustwide/target/x86_64-apple-darwin/debug/build/zstd-sys-d331e80d5a56560e/out/8957a4c8b028b07b-fse_decompress.o" "-c" "zstd/lib/common/fse_decompress.c" with args cc did not execute successfully (status code exit status: 1).cargo:warning=cc: error: unrecognized command-line option '-arch'
[INFO] [stderr] warning: zstd-sys@2.0.13+zstd.1.5.6: cc: error: unrecognized command-line option '-mmacosx-version-min=10.7'
[INFO] [stderr] warning: zstd-sys@2.0.13+zstd.1.5.6: ToolExecError: Command "cc" "-O0" "-ffunction-sections" "-fdata-sections" "-fPIC" "-gdwarf-2" "-fno-omit-frame-pointer" "-m64" "-arch" "x86_64" "-mmacosx-version-min=10.7" "-I" "zstd/lib/" "-I" "zstd/lib/common" "-I" "zstd/lib/legacy" "-fvisibility=hidden" "-DZSTD_LIB_DEPRECATED=0" "-DXXH_PRIVATE_API=" "-DZSTDLIB_VISIBILITY=" "-DZDICTLIB_VISIBILITY=" "-DZSTDERRORLIB_VISIBILITY=" "-DZSTD_LEGACY_SUPPORT=1" "-o" "/opt/rustwide/target/x86_64-apple-darwin/debug/build/zstd-sys-d331e80d5a56560e/out/8957a4c8b028b07b-pool.o" "-c" "zstd/lib/common/pool.c" with args cc did not execute successfully (status code exit status: 1).cargo:warning=cc: error: unrecognized command-line option '-arch'
[INFO] [stderr] warning: zstd-sys@2.0.13+zstd.1.5.6: cc: error: unrecognized command-line option '-mmacosx-version-min=10.7'
[INFO] [stderr] warning: zstd-sys@2.0.13+zstd.1.5.6: ToolExecError: Command "cc" "-O0" "-ffunction-sections" "-fdata-sections" "-fPIC" "-gdwarf-2" "-fno-omit-frame-pointer" "-m64" "-arch" "x86_64" "-mmacosx-version-min=10.7" "-I" "zstd/lib/" "-I" "zstd/lib/common" "-I" "zstd/lib/legacy" "-fvisibility=hidden" "-DZSTD_LIB_DEPRECATED=0" "-DXXH_PRIVATE_API=" "-DZSTDLIB_VISIBILITY=" "-DZDICTLIB_VISIBILITY=" "-DZSTDERRORLIB_VISIBILITY=" "-DZSTD_LEGACY_SUPPORT=1" "-o" "/opt/rustwide/target/x86_64-apple-darwin/debug/build/zstd-sys-d331e80d5a56560e/out/8957a4c8b028b07b-threading.o" "-c" "zstd/lib/common/threading.c" with args cc did not execute successfully (status code exit status: 1).cargo:warning=cc: error: unrecognized command-line option '-arch'
[INFO] [stderr] warning: zstd-sys@2.0.13+zstd.1.5.6: cc: error: unrecognized command-line option '-mmacosx-version-min=10.7'
[INFO] [stderr] warning: zstd-sys@2.0.13+zstd.1.5.6: ToolExecError: Command "cc" "-O0" "-ffunction-sections" "-fdata-sections" "-fPIC" "-gdwarf-2" "-fno-omit-frame-pointer" "-m64" "-arch" "x86_64" "-mmacosx-version-min=10.7" "-I" "zstd/lib/" "-I" "zstd/lib/common" "-I" "zstd/lib/legacy" "-fvisibility=hidden" "-DZSTD_LIB_DEPRECATED=0" "-DXXH_PRIVATE_API=" "-DZSTDLIB_VISIBILITY=" "-DZDICTLIB_VISIBILITY=" "-DZSTDERRORLIB_VISIBILITY=" "-DZSTD_LEGACY_SUPPORT=1" "-o" "/opt/rustwide/target/x86_64-apple-darwin/debug/build/zstd-sys-d331e80d5a56560e/out/8957a4c8b028b07b-zstd_common.o" "-c" "zstd/lib/common/zstd_common.c" with args cc did not execute successfully (status code exit status: 1).cargo:warning=cc: error: unrecognized command-line option '-arch'
[INFO] [stderr] warning: zstd-sys@2.0.13+zstd.1.5.6: cc: error: unrecognized command-line option '-mmacosx-version-min=10.7'
[INFO] [stderr] warning: zstd-sys@2.0.13+zstd.1.5.6: ToolExecError: Command "cc" "-O0" "-ffunction-sections" "-fdata-sections" "-fPIC" "-gdwarf-2" "-fno-omit-frame-pointer" "-m64" "-arch" "x86_64" "-mmacosx-version-min=10.7" "-I" "zstd/lib/" "-I" "zstd/lib/common" "-I" "zstd/lib/legacy" "-fvisibility=hidden" "-DZSTD_LIB_DEPRECATED=0" "-DXXH_PRIVATE_API=" "-DZSTDLIB_VISIBILITY=" "-DZDICTLIB_VISIBILITY=" "-DZSTDERRORLIB_VISIBILITY=" "-DZSTD_LEGACY_SUPPORT=1" "-o" "/opt/rustwide/target/x86_64-apple-darwin/debug/build/zstd-sys-d331e80d5a56560e/out/1ddd1489cc625d97-fse_compress.o" "-c" "zstd/lib/compress/fse_compress.c" with args cc did not execute successfully (status code exit status: 1).cargo:warning=cc: error: unrecognized command-line option '-arch'
[INFO] [stderr] warning: zstd-sys@2.0.13+zstd.1.5.6: cc: error: unrecognized command-line option '-mmacosx-version-min=10.7'
[INFO] [stderr] warning: zstd-sys@2.0.13+zstd.1.5.6: ToolExecError: Command "cc" "-O0" "-ffunction-sections" "-fdata-sections" "-fPIC" "-gdwarf-2" "-fno-omit-frame-pointer" "-m64" "-arch" "x86_64" "-mmacosx-version-min=10.7" "-I" "zstd/lib/" "-I" "zstd/lib/common" "-I" "zstd/lib/legacy" "-fvisibility=hidden" "-DZSTD_LIB_DEPRECATED=0" "-DXXH_PRIVATE_API=" "-DZSTDLIB_VISIBILITY=" "-DZDICTLIB_VISIBILITY=" "-DZSTDERRORLIB_VISIBILITY=" "-DZSTD_LEGACY_SUPPORT=1" "-o" "/opt/rustwide/target/x86_64-apple-darwin/debug/build/zstd-sys-d331e80d5a56560e/out/1ddd1489cc625d97-hist.o" "-c" "zstd/lib/compress/hist.c" with args cc did not execute successfully (status code exit status: 1).cargo:warning=cc: error: unrecognized command-line option '-arch'
[INFO] [stderr] warning: zstd-sys@2.0.13+zstd.1.5.6: cc: error: unrecognized command-line option '-mmacosx-version-min=10.7'
[INFO] [stderr] warning: zstd-sys@2.0.13+zstd.1.5.6: ToolExecError: Command "cc" "-O0" "-ffunction-sections" "-fdata-sections" "-fPIC" "-gdwarf-2" "-fno-omit-frame-pointer" "-m64" "-arch" "x86_64" "-mmacosx-version-min=10.7" "-I" "zstd/lib/" "-I" "zstd/lib/common" "-I" "zstd/lib/legacy" "-fvisibility=hidden" "-DZSTD_LIB_DEPRECATED=0" "-DXXH_PRIVATE_API=" "-DZSTDLIB_VISIBILITY=" "-DZDICTLIB_VISIBILITY=" "-DZSTDERRORLIB_VISIBILITY=" "-DZSTD_LEGACY_SUPPORT=1" "-o" "/opt/rustwide/target/x86_64-apple-darwin/debug/build/zstd-sys-d331e80d5a56560e/out/1ddd1489cc625d97-huf_compress.o" "-c" "zstd/lib/compress/huf_compress.c" with args cc did not execute successfully (status code exit status: 1).cargo:warning=cc: error: unrecognized command-line option '-arch'
[INFO] [stderr] warning: zstd-sys@2.0.13+zstd.1.5.6: cc: error: unrecognized command-line option '-mmacosx-version-min=10.7'
[INFO] [stderr] warning: zstd-sys@2.0.13+zstd.1.5.6: ToolExecError: Command "cc" "-O0" "-ffunction-sections" "-fdata-sections" "-fPIC" "-gdwarf-2" "-fno-omit-frame-pointer" "-m64" "-arch" "x86_64" "-mmacosx-version-min=10.7" "-I" "zstd/lib/" "-I" "zstd/lib/common" "-I" "zstd/lib/legacy" "-fvisibility=hidden" "-DZSTD_LIB_DEPRECATED=0" "-DXXH_PRIVATE_API=" "-DZSTDLIB_VISIBILITY=" "-DZDICTLIB_VISIBILITY=" "-DZSTDERRORLIB_VISIBILITY=" "-DZSTD_LEGACY_SUPPORT=1" "-o" "/opt/rustwide/target/x86_64-apple-darwin/debug/build/zstd-sys-d331e80d5a56560e/out/1ddd1489cc625d97-zstd_compress.o" "-c" "zstd/lib/compress/zstd_compress.c" with args cc did not execute successfully (status code exit status: 1).cargo:warning=cc: error: unrecognized command-line option '-arch'
[INFO] [stderr] warning: zstd-sys@2.0.13+zstd.1.5.6: cc: error: unrecognized command-line option '-mmacosx-version-min=10.7'
[INFO] [stderr] warning: zstd-sys@2.0.13+zstd.1.5.6: ToolExecError: Command "cc" "-O0" "-ffunction-sections" "-fdata-sections" "-fPIC" "-gdwarf-2" "-fno-omit-frame-pointer" "-m64" "-arch" "x86_64" "-mmacosx-version-min=10.7" "-I" "zstd/lib/" "-I" "zstd/lib/common" "-I" "zstd/lib/legacy" "-fvisibility=hidden" "-DZSTD_LIB_DEPRECATED=0" "-DXXH_PRIVATE_API=" "-DZSTDLIB_VISIBILITY=" "-DZDICTLIB_VISIBILITY=" "-DZSTDERRORLIB_VISIBILITY=" "-DZSTD_LEGACY_SUPPORT=1" "-o" "/opt/rustwide/target/x86_64-apple-darwin/debug/build/zstd-sys-d331e80d5a56560e/out/1ddd1489cc625d97-zstd_compress_literals.o" "-c" "zstd/lib/compress/zstd_compress_literals.c" with args cc did not execute successfully (status code exit status: 1).cargo:warning=cc: error: unrecognized command-line option '-arch'
[INFO] [stderr] warning: zstd-sys@2.0.13+zstd.1.5.6: cc: error: unrecognized command-line option '-mmacosx-version-min=10.7'
[INFO] [stderr] warning: zstd-sys@2.0.13+zstd.1.5.6: ToolExecError: Command "cc" "-O0" "-ffunction-sections" "-fdata-sections" "-fPIC" "-gdwarf-2" "-fno-omit-frame-pointer" "-m64" "-arch" "x86_64" "-mmacosx-version-min=10.7" "-I" "zstd/lib/" "-I" "zstd/lib/common" "-I" "zstd/lib/legacy" "-fvisibility=hidden" "-DZSTD_LIB_DEPRECATED=0" "-DXXH_PRIVATE_API=" "-DZSTDLIB_VISIBILITY=" "-DZDICTLIB_VISIBILITY=" "-DZSTDERRORLIB_VISIBILITY=" "-DZSTD_LEGACY_SUPPORT=1" "-o" "/opt/rustwide/target/x86_64-apple-darwin/debug/build/zstd-sys-d331e80d5a56560e/out/1ddd1489cc625d97-zstd_compress_sequences.o" "-c" "zstd/lib/compress/zstd_compress_sequences.c" with args cc did not execute successfully (status code exit status: 1).cargo:warning=cc: error: unrecognized command-line option '-arch'
[INFO] [stderr] warning: zstd-sys@2.0.13+zstd.1.5.6: cc: error: unrecognized command-line option '-mmacosx-version-min=10.7'
[INFO] [stderr] warning: zstd-sys@2.0.13+zstd.1.5.6: ToolExecError: Command "cc" "-O0" "-ffunction-sections" "-fdata-sections" "-fPIC" "-gdwarf-2" "-fno-omit-frame-pointer" "-m64" "-arch" "x86_64" "-mmacosx-version-min=10.7" "-I" "zstd/lib/" "-I" "zstd/lib/common" "-I" "zstd/lib/legacy" "-fvisibility=hidden" "-DZSTD_LIB_DEPRECATED=0" "-DXXH_PRIVATE_API=" "-DZSTDLIB_VISIBILITY=" "-DZDICTLIB_VISIBILITY=" "-DZSTDERRORLIB_VISIBILITY=" "-DZSTD_LEGACY_SUPPORT=1" "-o" "/opt/rustwide/target/x86_64-apple-darwin/debug/build/zstd-sys-d331e80d5a56560e/out/1ddd1489cc625d97-zstd_compress_superblock.o" "-c" "zstd/lib/compress/zstd_compress_superblock.c" with args cc did not execute successfully (status code exit status: 1).cargo:warning=cc: error: unrecognized command-line option '-arch'
[INFO] [stderr] warning: zstd-sys@2.0.13+zstd.1.5.6: cc: error: unrecognized command-line option '-mmacosx-version-min=10.7'
[INFO] [stderr] warning: zstd-sys@2.0.13+zstd.1.5.6: ToolExecError: Command "cc" "-O0" "-ffunction-sections" "-fdata-sections" "-fPIC" "-gdwarf-2" "-fno-omit-frame-pointer" "-m64" "-arch" "x86_64" "-mmacosx-version-min=10.7" "-I" "zstd/lib/" "-I" "zstd/lib/common" "-I" "zstd/lib/legacy" "-fvisibility=hidden" "-DZSTD_LIB_DEPRECATED=0" "-DXXH_PRIVATE_API=" "-DZSTDLIB_VISIBILITY=" "-DZDICTLIB_VISIBILITY=" "-DZSTDERRORLIB_VISIBILITY=" "-DZSTD_LEGACY_SUPPORT=1" "-o" "/opt/rustwide/target/x86_64-apple-darwin/debug/build/zstd-sys-d331e80d5a56560e/out/1ddd1489cc625d97-zstd_double_fast.o" "-c" "zstd/lib/compress/zstd_double_fast.c" with args cc did not execute successfully (status code exit status: 1).cargo:warning=cc: error: unrecognized command-line option '-arch'
[INFO] [stderr] warning: zstd-sys@2.0.13+zstd.1.5.6: cc: error: unrecognized command-line option '-mmacosx-version-min=10.7'
[INFO] [stderr] warning: zstd-sys@2.0.13+zstd.1.5.6: ToolExecError: Command "cc" "-O0" "-ffunction-sections" "-fdata-sections" "-fPIC" "-gdwarf-2" "-fno-omit-frame-pointer" "-m64" "-arch" "x86_64" "-mmacosx-version-min=10.7" "-I" "zstd/lib/" "-I" "zstd/lib/common" "-I" "zstd/lib/legacy" "-fvisibility=hidden" "-DZSTD_LIB_DEPRECATED=0" "-DXXH_PRIVATE_API=" "-DZSTDLIB_VISIBILITY=" "-DZDICTLIB_VISIBILITY=" "-DZSTDERRORLIB_VISIBILITY=" "-DZSTD_LEGACY_SUPPORT=1" "-o" "/opt/rustwide/target/x86_64-apple-darwin/debug/build/zstd-sys-d331e80d5a56560e/out/1ddd1489cc625d97-zstd_fast.o" "-c" "zstd/lib/compress/zstd_fast.c" with args cc did not execute successfully (status code exit status: 1).cargo:warning=cc: error: unrecognized command-line option '-arch'
[INFO] [stderr] warning: zstd-sys@2.0.13+zstd.1.5.6: cc: error: unrecognized command-line option '-mmacosx-version-min=10.7'
[INFO] [stderr] warning: zstd-sys@2.0.13+zstd.1.5.6: ToolExecError: Command "cc" "-O0" "-ffunction-sections" "-fdata-sections" "-fPIC" "-gdwarf-2" "-fno-omit-frame-pointer" "-m64" "-arch" "x86_64" "-mmacosx-version-min=10.7" "-I" "zstd/lib/" "-I" "zstd/lib/common" "-I" "zstd/lib/legacy" "-fvisibility=hidden" "-DZSTD_LIB_DEPRECATED=0" "-DXXH_PRIVATE_API=" "-DZSTDLIB_VISIBILITY=" "-DZDICTLIB_VISIBILITY=" "-DZSTDERRORLIB_VISIBILITY=" "-DZSTD_LEGACY_SUPPORT=1" "-o" "/opt/rustwide/target/x86_64-apple-darwin/debug/build/zstd-sys-d331e80d5a56560e/out/1ddd1489cc625d97-zstd_lazy.o" "-c" "zstd/lib/compress/zstd_lazy.c" with args cc did not execute successfully (status code exit status: 1).cargo:warning=cc: error: unrecognized command-line option '-arch'
[INFO] [stderr] warning: zstd-sys@2.0.13+zstd.1.5.6: cc: error: unrecognized command-line option '-mmacosx-version-min=10.7'
[INFO] [stderr] warning: zstd-sys@2.0.13+zstd.1.5.6: ToolExecError: Command "cc" "-O0" "-ffunction-sections" "-fdata-sections" "-fPIC" "-gdwarf-2" "-fno-omit-frame-pointer" "-m64" "-arch" "x86_64" "-mmacosx-version-min=10.7" "-I" "zstd/lib/" "-I" "zstd/lib/common" "-I" "zstd/lib/legacy" "-fvisibility=hidden" "-DZSTD_LIB_DEPRECATED=0" "-DXXH_PRIVATE_API=" "-DZSTDLIB_VISIBILITY=" "-DZDICTLIB_VISIBILITY=" "-DZSTDERRORLIB_VISIBILITY=" "-DZSTD_LEGACY_SUPPORT=1" "-o" "/opt/rustwide/target/x86_64-apple-darwin/debug/build/zstd-sys-d331e80d5a56560e/out/1ddd1489cc625d97-zstd_ldm.o" "-c" "zstd/lib/compress/zstd_ldm.c" with args cc did not execute successfully (status code exit status: 1).cargo:warning=cc: error: unrecognized command-line option '-arch'
[INFO] [stderr] warning: zstd-sys@2.0.13+zstd.1.5.6: cc: error: unrecognized command-line option '-mmacosx-version-min=10.7'
[INFO] [stderr] warning: zstd-sys@2.0.13+zstd.1.5.6: ToolExecError: Command "cc" "-O0" "-ffunction-sections" "-fdata-sections" "-fPIC" "-gdwarf-2" "-fno-omit-frame-pointer" "-m64" "-arch" "x86_64" "-mmacosx-version-min=10.7" "-I" "zstd/lib/" "-I" "zstd/lib/common" "-I" "zstd/lib/legacy" "-fvisibility=hidden" "-DZSTD_LIB_DEPRECATED=0" "-DXXH_PRIVATE_API=" "-DZSTDLIB_VISIBILITY=" "-DZDICTLIB_VISIBILITY=" "-DZSTDERRORLIB_VISIBILITY=" "-DZSTD_LEGACY_SUPPORT=1" "-o" "/opt/rustwide/target/x86_64-apple-darwin/debug/build/zstd-sys-d331e80d5a56560e/out/1ddd1489cc625d97-zstd_opt.o" "-c" "zstd/lib/compress/zstd_opt.c" with args cc did not execute successfully (status code exit status: 1).cargo:warning=cc: error: unrecognized command-line option '-arch'
[INFO] [stderr] warning: zstd-sys@2.0.13+zstd.1.5.6: cc: error: unrecognized command-line option '-mmacosx-version-min=10.7'
[INFO] [stderr] warning: zstd-sys@2.0.13+zstd.1.5.6: ToolExecError: Command "cc" "-O0" "-ffunction-sections" "-fdata-sections" "-fPIC" "-gdwarf-2" "-fno-omit-frame-pointer" "-m64" "-arch" "x86_64" "-mmacosx-version-min=10.7" "-I" "zstd/lib/" "-I" "zstd/lib/common" "-I" "zstd/lib/legacy" "-fvisibility=hidden" "-DZSTD_LIB_DEPRECATED=0" "-DXXH_PRIVATE_API=" "-DZSTDLIB_VISIBILITY=" "-DZDICTLIB_VISIBILITY=" "-DZSTDERRORLIB_VISIBILITY=" "-DZSTD_LEGACY_SUPPORT=1" "-o" "/opt/rustwide/target/x86_64-apple-darwin/debug/build/zstd-sys-d331e80d5a56560e/out/1ddd1489cc625d97-zstdmt_compress.o" "-c" "zstd/lib/compress/zstdmt_compress.c" with args cc did not execute successfully (status code exit status: 1).cargo:warning=cc: error: unrecognized command-line option '-arch'
[INFO] [stderr] warning: zstd-sys@2.0.13+zstd.1.5.6: cc: error: unrecognized command-line option '-mmacosx-version-min=10.7'
[INFO] [stderr] warning: zstd-sys@2.0.13+zstd.1.5.6: ToolExecError: Command "cc" "-O0" "-ffunction-sections" "-fdata-sections" "-fPIC" "-gdwarf-2" "-fno-omit-frame-pointer" "-m64" "-arch" "x86_64" "-mmacosx-version-min=10.7" "-I" "zstd/lib/" "-I" "zstd/lib/common" "-I" "zstd/lib/legacy" "-fvisibility=hidden" "-DZSTD_LIB_DEPRECATED=0" "-DXXH_PRIVATE_API=" "-DZSTDLIB_VISIBILITY=" "-DZDICTLIB_VISIBILITY=" "-DZSTDERRORLIB_VISIBILITY=" "-DZSTD_LEGACY_SUPPORT=1" "-o" "/opt/rustwide/target/x86_64-apple-darwin/debug/build/zstd-sys-d331e80d5a56560e/out/690f776bf7b37aeb-huf_decompress.o" "-c" "zstd/lib/decompress/huf_decompress.c" with args cc did not execute successfully (status code exit status: 1).cargo:warning=cc: error: unrecognized command-line option '-arch'
[INFO] [stderr] warning: zstd-sys@2.0.13+zstd.1.5.6: cc: error: unrecognized command-line option '-mmacosx-version-min=10.7'
[INFO] [stderr] warning: zstd-sys@2.0.13+zstd.1.5.6: ToolExecError: Command "cc" "-O0" "-ffunction-sections" "-fdata-sections" "-fPIC" "-gdwarf-2" "-fno-omit-frame-pointer" "-m64" "-arch" "x86_64" "-mmacosx-version-min=10.7" "-I" "zstd/lib/" "-I" "zstd/lib/common" "-I" "zstd/lib/legacy" "-fvisibility=hidden" "-DZSTD_LIB_DEPRECATED=0" "-DXXH_PRIVATE_API=" "-DZSTDLIB_VISIBILITY=" "-DZDICTLIB_VISIBILITY=" "-DZSTDERRORLIB_VISIBILITY=" "-DZSTD_LEGACY_SUPPORT=1" "-o" "/opt/rustwide/target/x86_64-apple-darwin/debug/build/zstd-sys-d331e80d5a56560e/out/690f776bf7b37aeb-zstd_ddict.o" "-c" "zstd/lib/decompress/zstd_ddict.c" with args cc did not execute successfully (status code exit status: 1).cargo:warning=cc: error: unrecognized command-line option '-arch'
[INFO] [stderr] warning: zstd-sys@2.0.13+zstd.1.5.6: cc: error: unrecognized command-line option '-mmacosx-version-min=10.7'
[INFO] [stderr] warning: zstd-sys@2.0.13+zstd.1.5.6: ToolExecError: Command "cc" "-O0" "-ffunction-sections" "-fdata-sections" "-fPIC" "-gdwarf-2" "-fno-omit-frame-pointer" "-m64" "-arch" "x86_64" "-mmacosx-version-min=10.7" "-I" "zstd/lib/" "-I" "zstd/lib/common" "-I" "zstd/lib/legacy" "-fvisibility=hidden" "-DZSTD_LIB_DEPRECATED=0" "-DXXH_PRIVATE_API=" "-DZSTDLIB_VISIBILITY=" "-DZDICTLIB_VISIBILITY=" "-DZSTDERRORLIB_VISIBILITY=" "-DZSTD_LEGACY_SUPPORT=1" "-o" "/opt/rustwide/target/x86_64-apple-darwin/debug/build/zstd-sys-d331e80d5a56560e/out/690f776bf7b37aeb-zstd_decompress.o" "-c" "zstd/lib/decompress/zstd_decompress.c" with args cc did not execute successfully (status code exit status: 1).cargo:warning=cc: error: unrecognized command-line option '-arch'
[INFO] [stderr] warning: zstd-sys@2.0.13+zstd.1.5.6: cc: error: unrecognized command-line option '-mmacosx-version-min=10.7'
[INFO] [stderr] warning: zstd-sys@2.0.13+zstd.1.5.6: ToolExecError: Command "cc" "-O0" "-ffunction-sections" "-fdata-sections" "-fPIC" "-gdwarf-2" "-fno-omit-frame-pointer" "-m64" "-arch" "x86_64" "-mmacosx-version-min=10.7" "-I" "zstd/lib/" "-I" "zstd/lib/common" "-I" "zstd/lib/legacy" "-fvisibility=hidden" "-DZSTD_LIB_DEPRECATED=0" "-DXXH_PRIVATE_API=" "-DZSTDLIB_VISIBILITY=" "-DZDICTLIB_VISIBILITY=" "-DZSTDERRORLIB_VISIBILITY=" "-DZSTD_LEGACY_SUPPORT=1" "-o" "/opt/rustwide/target/x86_64-apple-darwin/debug/build/zstd-sys-d331e80d5a56560e/out/690f776bf7b37aeb-zstd_decompress_block.o" "-c" "zstd/lib/decompress/zstd_decompress_block.c" with args cc did not execute successfully (status code exit status: 1).cargo:warning=cc: error: unrecognized command-line option '-arch'
[INFO] [stderr] warning: zstd-sys@2.0.13+zstd.1.5.6: cc: error: unrecognized command-line option '-mmacosx-version-min=10.7'
[INFO] [stderr] warning: zstd-sys@2.0.13+zstd.1.5.6: ToolExecError: Command "cc" "-O0" "-ffunction-sections" "-fdata-sections" "-fPIC" "-gdwarf-2" "-fno-omit-frame-pointer" "-m64" "-arch" "x86_64" "-mmacosx-version-min=10.7" "-I" "zstd/lib/" "-I" "zstd/lib/common" "-I" "zstd/lib/legacy" "-fvisibility=hidden" "-DZSTD_LIB_DEPRECATED=0" "-DXXH_PRIVATE_API=" "-DZSTDLIB_VISIBILITY=" "-DZDICTLIB_VISIBILITY=" "-DZSTDERRORLIB_VISIBILITY=" "-DZSTD_LEGACY_SUPPORT=1" "-o" "/opt/rustwide/target/x86_64-apple-darwin/debug/build/zstd-sys-d331e80d5a56560e/out/b0401a448be314bb-cover.o" "-c" "zstd/lib/dictBuilder/cover.c" with args cc did not execute successfully (status code exit status: 1).cargo:warning=cc: error: unrecognized command-line option '-arch'
[INFO] [stderr] warning: zstd-sys@2.0.13+zstd.1.5.6: cc: error: unrecognized command-line option '-mmacosx-version-min=10.7'
[INFO] [stderr] warning: zstd-sys@2.0.13+zstd.1.5.6: ToolExecError: Command "cc" "-O0" "-ffunction-sections" "-fdata-sections" "-fPIC" "-gdwarf-2" "-fno-omit-frame-pointer" "-m64" "-arch" "x86_64" "-mmacosx-version-min=10.7" "-I" "zstd/lib/" "-I" "zstd/lib/common" "-I" "zstd/lib/legacy" "-fvisibility=hidden" "-DZSTD_LIB_DEPRECATED=0" "-DXXH_PRIVATE_API=" "-DZSTDLIB_VISIBILITY=" "-DZDICTLIB_VISIBILITY=" "-DZSTDERRORLIB_VISIBILITY=" "-DZSTD_LEGACY_SUPPORT=1" "-o" "/opt/rustwide/target/x86_64-apple-darwin/debug/build/zstd-sys-d331e80d5a56560e/out/b0401a448be314bb-divsufsort.o" "-c" "zstd/lib/dictBuilder/divsufsort.c" with args cc did not execute successfully (status code exit status: 1).cargo:warning=cc: error: unrecognized command-line option '-arch'
[INFO] [stderr] warning: zstd-sys@2.0.13+zstd.1.5.6: cc: error: unrecognized command-line option '-mmacosx-version-min=10.7'
[INFO] [stderr] warning: zstd-sys@2.0.13+zstd.1.5.6: ToolExecError: Command "cc" "-O0" "-ffunction-sections" "-fdata-sections" "-fPIC" "-gdwarf-2" "-fno-omit-frame-pointer" "-m64" "-arch" "x86_64" "-mmacosx-version-min=10.7" "-I" "zstd/lib/" "-I" "zstd/lib/common" "-I" "zstd/lib/legacy" "-fvisibility=hidden" "-DZSTD_LIB_DEPRECATED=0" "-DXXH_PRIVATE_API=" "-DZSTDLIB_VISIBILITY=" "-DZDICTLIB_VISIBILITY=" "-DZSTDERRORLIB_VISIBILITY=" "-DZSTD_LEGACY_SUPPORT=1" "-o" "/opt/rustwide/target/x86_64-apple-darwin/debug/build/zstd-sys-d331e80d5a56560e/out/b0401a448be314bb-fastcover.o" "-c" "zstd/lib/dictBuilder/fastcover.c" with args cc did not execute successfully (status code exit status: 1).cargo:warning=cc: error: unrecognized command-line option '-arch'
[INFO] [stderr] warning: zstd-sys@2.0.13+zstd.1.5.6: cc: error: unrecognized command-line option '-mmacosx-version-min=10.7'
[INFO] [stderr] warning: zstd-sys@2.0.13+zstd.1.5.6: ToolExecError: Command "cc" "-O0" "-ffunction-sections" "-fdata-sections" "-fPIC" "-gdwarf-2" "-fno-omit-frame-pointer" "-m64" "-arch" "x86_64" "-mmacosx-version-min=10.7" "-I" "zstd/lib/" "-I" "zstd/lib/common" "-I" "zstd/lib/legacy" "-fvisibility=hidden" "-DZSTD_LIB_DEPRECATED=0" "-DXXH_PRIVATE_API=" "-DZSTDLIB_VISIBILITY=" "-DZDICTLIB_VISIBILITY=" "-DZSTDERRORLIB_VISIBILITY=" "-DZSTD_LEGACY_SUPPORT=1" "-o" "/opt/rustwide/target/x86_64-apple-darwin/debug/build/zstd-sys-d331e80d5a56560e/out/b0401a448be314bb-zdict.o" "-c" "zstd/lib/dictBuilder/zdict.c" with args cc did not execute successfully (status code exit status: 1).cargo:warning=cc: error: unrecognized command-line option '-arch'
[INFO] [stderr] warning: zstd-sys@2.0.13+zstd.1.5.6: cc: error: unrecognized command-line option '-mmacosx-version-min=10.7'
[INFO] [stderr] warning: zstd-sys@2.0.13+zstd.1.5.6: ToolExecError: Command "cc" "-O0" "-ffunction-sections" "-fdata-sections" "-fPIC" "-gdwarf-2" "-fno-omit-frame-pointer" "-m64" "-arch" "x86_64" "-mmacosx-version-min=10.7" "-I" "zstd/lib/" "-I" "zstd/lib/common" "-I" "zstd/lib/legacy" "-fvisibility=hidden" "-DZSTD_LIB_DEPRECATED=0" "-DXXH_PRIVATE_API=" "-DZSTDLIB_VISIBILITY=" "-DZDICTLIB_VISIBILITY=" "-DZSTDERRORLIB_VISIBILITY=" "-DZSTD_LEGACY_SUPPORT=1" "-o" "/opt/rustwide/target/x86_64-apple-darwin/debug/build/zstd-sys-d331e80d5a56560e/out/5eeec2f4c1e9b3b6-zstd_v01.o" "-c" "zstd/lib/legacy/zstd_v01.c" with args cc did not execute successfully (status code exit status: 1).cargo:warning=cc: error: unrecognized command-line option '-arch'
[INFO] [stderr] warning: zstd-sys@2.0.13+zstd.1.5.6: cc: error: unrecognized command-line option '-mmacosx-version-min=10.7'
[INFO] [stderr] warning: zstd-sys@2.0.13+zstd.1.5.6: ToolExecError: Command "cc" "-O0" "-ffunction-sections" "-fdata-sections" "-fPIC" "-gdwarf-2" "-fno-omit-frame-pointer" "-m64" "-arch" "x86_64" "-mmacosx-version-min=10.7" "-I" "zstd/lib/" "-I" "zstd/lib/common" "-I" "zstd/lib/legacy" "-fvisibility=hidden" "-DZSTD_LIB_DEPRECATED=0" "-DXXH_PRIVATE_API=" "-DZSTDLIB_VISIBILITY=" "-DZDICTLIB_VISIBILITY=" "-DZSTDERRORLIB_VISIBILITY=" "-DZSTD_LEGACY_SUPPORT=1" "-o" "/opt/rustwide/target/x86_64-apple-darwin/debug/build/zstd-sys-d331e80d5a56560e/out/5eeec2f4c1e9b3b6-zstd_v02.o" "-c" "zstd/lib/legacy/zstd_v02.c" with args cc did not execute successfully (status code exit status: 1).cargo:warning=cc: error: unrecognized command-line option '-arch'
[INFO] [stderr] warning: zstd-sys@2.0.13+zstd.1.5.6: cc: error: unrecognized command-line option '-mmacosx-version-min=10.7'
[INFO] [stderr] warning: zstd-sys@2.0.13+zstd.1.5.6: ToolExecError: Command "cc" "-O0" "-ffunction-sections" "-fdata-sections" "-fPIC" "-gdwarf-2" "-fno-omit-frame-pointer" "-m64" "-arch" "x86_64" "-mmacosx-version-min=10.7" "-I" "zstd/lib/" "-I" "zstd/lib/common" "-I" "zstd/lib/legacy" "-fvisibility=hidden" "-DZSTD_LIB_DEPRECATED=0" "-DXXH_PRIVATE_API=" "-DZSTDLIB_VISIBILITY=" "-DZDICTLIB_VISIBILITY=" "-DZSTDERRORLIB_VISIBILITY=" "-DZSTD_LEGACY_SUPPORT=1" "-o" "/opt/rustwide/target/x86_64-apple-darwin/debug/build/zstd-sys-d331e80d5a56560e/out/5eeec2f4c1e9b3b6-zstd_v03.o" "-c" "zstd/lib/legacy/zstd_v03.c" with args cc did not execute successfully (status code exit status: 1).cargo:warning=cc: error: unrecognized command-line option '-arch'
[INFO] [stderr] warning: zstd-sys@2.0.13+zstd.1.5.6: cc: error: unrecognized command-line option '-mmacosx-version-min=10.7'
[INFO] [stderr] warning: zstd-sys@2.0.13+zstd.1.5.6: ToolExecError: Command "cc" "-O0" "-ffunction-sections" "-fdata-sections" "-fPIC" "-gdwarf-2" "-fno-omit-frame-pointer" "-m64" "-arch" "x86_64" "-mmacosx-version-min=10.7" "-I" "zstd/lib/" "-I" "zstd/lib/common" "-I" "zstd/lib/legacy" "-fvisibility=hidden" "-DZSTD_LIB_DEPRECATED=0" "-DXXH_PRIVATE_API=" "-DZSTDLIB_VISIBILITY=" "-DZDICTLIB_VISIBILITY=" "-DZSTDERRORLIB_VISIBILITY=" "-DZSTD_LEGACY_SUPPORT=1" "-o" "/opt/rustwide/target/x86_64-apple-darwin/debug/build/zstd-sys-d331e80d5a56560e/out/5eeec2f4c1e9b3b6-zstd_v04.o" "-c" "zstd/lib/legacy/zstd_v04.c" with args cc did not execute successfully (status code exit status: 1).cargo:warning=cc: error: unrecognized command-line option '-arch'
[INFO] [stderr] warning: zstd-sys@2.0.13+zstd.1.5.6: cc: error: unrecognized command-line option '-mmacosx-version-min=10.7'
[INFO] [stderr] warning: zstd-sys@2.0.13+zstd.1.5.6: ToolExecError: Command "cc" "-O0" "-ffunction-sections" "-fdata-sections" "-fPIC" "-gdwarf-2" "-fno-omit-frame-pointer" "-m64" "-arch" "x86_64" "-mmacosx-version-min=10.7" "-I" "zstd/lib/" "-I" "zstd/lib/common" "-I" "zstd/lib/legacy" "-fvisibility=hidden" "-DZSTD_LIB_DEPRECATED=0" "-DXXH_PRIVATE_API=" "-DZSTDLIB_VISIBILITY=" "-DZDICTLIB_VISIBILITY=" "-DZSTDERRORLIB_VISIBILITY=" "-DZSTD_LEGACY_SUPPORT=1" "-o" "/opt/rustwide/target/x86_64-apple-darwin/debug/build/zstd-sys-d331e80d5a56560e/out/5eeec2f4c1e9b3b6-zstd_v05.o" "-c" "zstd/lib/legacy/zstd_v05.c" with args cc did not execute successfully (status code exit status: 1).cargo:warning=cc: error: unrecognized command-line option '-arch'
[INFO] [stderr] warning: zstd-sys@2.0.13+zstd.1.5.6: cc: error: unrecognized command-line option '-mmacosx-version-min=10.7'
[INFO] [stderr] warning: zstd-sys@2.0.13+zstd.1.5.6: ToolExecError: Command "cc" "-O0" "-ffunction-sections" "-fdata-sections" "-fPIC" "-gdwarf-2" "-fno-omit-frame-pointer" "-m64" "-arch" "x86_64" "-mmacosx-version-min=10.7" "-I" "zstd/lib/" "-I" "zstd/lib/common" "-I" "zstd/lib/legacy" "-fvisibility=hidden" "-DZSTD_LIB_DEPRECATED=0" "-DXXH_PRIVATE_API=" "-DZSTDLIB_VISIBILITY=" "-DZDICTLIB_VISIBILITY=" "-DZSTDERRORLIB_VISIBILITY=" "-DZSTD_LEGACY_SUPPORT=1" "-o" "/opt/rustwide/target/x86_64-apple-darwin/debug/build/zstd-sys-d331e80d5a56560e/out/5eeec2f4c1e9b3b6-zstd_v06.o" "-c" "zstd/lib/legacy/zstd_v06.c" with args cc did not execute successfully (status code exit status: 1).cargo:warning=cc: error: unrecognized command-line option '-arch'
[INFO] [stderr] warning: zstd-sys@2.0.13+zstd.1.5.6: cc: error: unrecognized command-line option '-mmacosx-version-min=10.7'
[INFO] [stderr] warning: zstd-sys@2.0.13+zstd.1.5.6: ToolExecError: Command "cc" "-O0" "-ffunction-sections" "-fdata-sections" "-fPIC" "-gdwarf-2" "-fno-omit-frame-pointer" "-m64" "-arch" "x86_64" "-mmacosx-version-min=10.7" "-I" "zstd/lib/" "-I" "zstd/lib/common" "-I" "zstd/lib/legacy" "-fvisibility=hidden" "-DZSTD_LIB_DEPRECATED=0" "-DXXH_PRIVATE_API=" "-DZSTDLIB_VISIBILITY=" "-DZDICTLIB_VISIBILITY=" "-DZSTDERRORLIB_VISIBILITY=" "-DZSTD_LEGACY_SUPPORT=1" "-o" "/opt/rustwide/target/x86_64-apple-darwin/debug/build/zstd-sys-d331e80d5a56560e/out/5eeec2f4c1e9b3b6-zstd_v07.o" "-c" "zstd/lib/legacy/zstd_v07.c" with args cc did not execute successfully (status code exit status: 1).cargo:warning=cc: error: unrecognized command-line option '-arch'
[INFO] [stderr] warning: zstd-sys@2.0.13+zstd.1.5.6: cc: error: unrecognized command-line option '-mmacosx-version-min=10.7'
[INFO] [stderr] warning: zstd-sys@2.0.13+zstd.1.5.6: ToolExecError: Command "cc" "-O0" "-ffunction-sections" "-fdata-sections" "-fPIC" "-gdwarf-2" "-fno-omit-frame-pointer" "-m64" "-arch" "x86_64" "-mmacosx-version-min=10.7" "-I" "zstd/lib/" "-I" "zstd/lib/common" "-I" "zstd/lib/legacy" "-fvisibility=hidden" "-DZSTD_LIB_DEPRECATED=0" "-DXXH_PRIVATE_API=" "-DZSTDLIB_VISIBILITY=" "-DZDICTLIB_VISIBILITY=" "-DZSTDERRORLIB_VISIBILITY=" "-DZSTD_LEGACY_SUPPORT=1" "-o" "/opt/rustwide/target/x86_64-apple-darwin/debug/build/zstd-sys-d331e80d5a56560e/out/690f776bf7b37aeb-huf_decompress_amd64.o" "-c" "zstd/lib/decompress/huf_decompress_amd64.S" with args cc did not execute successfully (status code exit status: 1).
[INFO] [stderr] 
[INFO] [stderr] error: failed to run custom build command for `zstd-sys v2.0.13+zstd.1.5.6`
[INFO] [stderr] 
[INFO] [stderr] Caused by:
[INFO] [stderr]   process didn't exit successfully: `/opt/rustwide/target/debug/build/zstd-sys-c1bde9cce026ff7d/build-script-build` (exit status: 1)
[INFO] [stderr]   --- stdout
[INFO] [stderr]   cargo:rerun-if-env-changed=ZSTD_SYS_USE_PKG_CONFIG
[INFO] [stderr]   OUT_DIR = Some(/opt/rustwide/target/x86_64-apple-darwin/debug/build/zstd-sys-d331e80d5a56560e/out)
[INFO] [stderr]   TARGET = Some(x86_64-apple-darwin)
[INFO] [stderr]   OPT_LEVEL = Some(0)
[INFO] [stderr]   HOST = Some(x86_64-unknown-linux-gnu)
[INFO] [stderr]   cargo:rerun-if-env-changed=CC_x86_64-apple-darwin
[INFO] [stderr]   CC_x86_64-apple-darwin = None
[INFO] [stderr]   cargo:rerun-if-env-changed=CC_x86_64_apple_darwin
[INFO] [stderr]   CC_x86_64_apple_darwin = None
[INFO] [stderr]   cargo:rerun-if-env-changed=TARGET_CC
[INFO] [stderr]   TARGET_CC = None
[INFO] [stderr]   cargo:rerun-if-env-changed=CC
[INFO] [stderr]   CC = None
[INFO] [stderr]   cargo:rerun-if-env-changed=CROSS_COMPILE
[INFO] [stderr]   CROSS_COMPILE = None
[INFO] [stderr]   RUSTC_LINKER = None
[INFO] [stderr]   cargo:rerun-if-env-changed=CC_ENABLE_DEBUG_OUTPUT
[INFO] [stderr]   RUSTC_WRAPPER = None
[INFO] [stderr]   cargo:rerun-if-env-changed=CRATE_CC_NO_DEFAULTS
[INFO] [stderr]   CRATE_CC_NO_DEFAULTS = None
[INFO] [stderr]   DEBUG = Some(true)
[INFO] [stderr]   CARGO_CFG_TARGET_FEATURE = Some(cmpxchg16b,fxsr,lahfsahf,sse,sse2,sse3,sse4.1,ssse3)
[INFO] [stderr]   cargo:rerun-if-env-changed=MACOSX_DEPLOYMENT_TARGET
[INFO] [stderr]   MACOSX_DEPLOYMENT_TARGET = None
[INFO] [stderr]   cargo:rerun-if-env-changed=CFLAGS_x86_64-apple-darwin
[INFO] [stderr]   CFLAGS_x86_64-apple-darwin = None
[INFO] [stderr]   cargo:rerun-if-env-changed=CFLAGS_x86_64_apple_darwin
[INFO] [stderr]   CFLAGS_x86_64_apple_darwin = None
[INFO] [stderr]   cargo:rerun-if-env-changed=TARGET_CFLAGS
[INFO] [stderr]   TARGET_CFLAGS = None
[INFO] [stderr]   cargo:rerun-if-env-changed=CFLAGS
[INFO] [stderr]   CFLAGS = None
[INFO] [stderr]   OUT_DIR = Some(/opt/rustwide/target/x86_64-apple-darwin/debug/build/zstd-sys-d331e80d5a56560e/out)
[INFO] [stderr]   cargo:rerun-if-env-changed=CC_ENABLE_DEBUG_OUTPUT
[INFO] [stderr]   cargo:rerun-if-env-changed=CRATE_CC_NO_DEFAULTS
[INFO] [stderr]   CRATE_CC_NO_DEFAULTS = None
[INFO] [stderr]   CARGO_CFG_TARGET_FEATURE = Some(cmpxchg16b,fxsr,lahfsahf,sse,sse2,sse3,sse4.1,ssse3)
[INFO] [stderr]   cargo:rerun-if-env-changed=MACOSX_DEPLOYMENT_TARGET
[INFO] [stderr]   MACOSX_DEPLOYMENT_TARGET = None
[INFO] [stderr]   cargo:rerun-if-env-changed=CFLAGS_x86_64-apple-darwin
[INFO] [stderr]   CFLAGS_x86_64-apple-darwin = None
[INFO] [stderr]   cargo:rerun-if-env-changed=CFLAGS_x86_64_apple_darwin
[INFO] [stderr]   CFLAGS_x86_64_apple_darwin = None
[INFO] [stderr]   cargo:rerun-if-env-changed=TARGET_CFLAGS
[INFO] [stderr]   TARGET_CFLAGS = None
[INFO] [stderr]   cargo:rerun-if-env-changed=CFLAGS
[INFO] [stderr]   CFLAGS = None
[INFO] [stderr]   OUT_DIR = Some(/opt/rustwide/target/x86_64-apple-darwin/debug/build/zstd-sys-d331e80d5a56560e/out)
[INFO] [stderr]   cargo:rerun-if-env-changed=CC_ENABLE_DEBUG_OUTPUT
[INFO] [stderr]   cargo:rerun-if-env-changed=CRATE_CC_NO_DEFAULTS
[INFO] [stderr]   CRATE_CC_NO_DEFAULTS = None
[INFO] [stderr]   CARGO_CFG_TARGET_FEATURE = Some(cmpxchg16b,fxsr,lahfsahf,sse,sse2,sse3,sse4.1,ssse3)
[INFO] [stderr]   cargo:rerun-if-env-changed=MACOSX_DEPLOYMENT_TARGET
[INFO] [stderr]   MACOSX_DEPLOYMENT_TARGET = None
[INFO] [stderr]   cargo:rerun-if-env-changed=CFLAGS_x86_64-apple-darwin
[INFO] [stderr]   CFLAGS_x86_64-apple-darwin = None
[INFO] [stderr]   cargo:rerun-if-env-changed=CFLAGS_x86_64_apple_darwin
[INFO] [stderr]   CFLAGS_x86_64_apple_darwin = None
[INFO] [stderr]   cargo:rerun-if-env-changed=TARGET_CFLAGS
[INFO] [stderr]   TARGET_CFLAGS = None
[INFO] [stderr]   cargo:rerun-if-env-changed=CFLAGS
[INFO] [stderr]   CFLAGS = None
[INFO] [stderr]   OUT_DIR = Some(/opt/rustwide/target/x86_64-apple-darwin/debug/build/zstd-sys-d331e80d5a56560e/out)
[INFO] [stderr]   cargo:rerun-if-env-changed=CC_ENABLE_DEBUG_OUTPUT
[INFO] [stderr]   cargo:rerun-if-env-changed=CRATE_CC_NO_DEFAULTS
[INFO] [stderr]   CRATE_CC_NO_DEFAULTS = None
[INFO] [stderr]   CARGO_CFG_TARGET_FEATURE = Some(cmpxchg16b,fxsr,lahfsahf,sse,sse2,sse3,sse4.1,ssse3)
[INFO] [stderr]   cargo:rerun-if-env-changed=MACOSX_DEPLOYMENT_TARGET
[INFO] [stderr]   MACOSX_DEPLOYMENT_TARGET = None
[INFO] [stderr]   cargo:rerun-if-env-changed=CFLAGS_x86_64-apple-darwin
[INFO] [stderr]   CFLAGS_x86_64-apple-darwin = None
[INFO] [stderr]   cargo:rerun-if-env-changed=CFLAGS_x86_64_apple_darwin
[INFO] [stderr]   CFLAGS_x86_64_apple_darwin = None
[INFO] [stderr]   cargo:rerun-if-env-changed=TARGET_CFLAGS
[INFO] [stderr]   TARGET_CFLAGS = None
[INFO] [stderr]   cargo:rerun-if-env-changed=CFLAGS
[INFO] [stderr]   CFLAGS = None
[INFO] [stderr]   cargo:warning=cc: error: unrecognized command-line option '-arch'
[INFO] [stderr]   cargo:warning=cc: error: unrecognized command-line option '-mmacosx-version-min=10.7'
[INFO] [stderr]   exit status: 1
[INFO] [stderr]   cargo:warning=ToolExecError: Command "cc" "-O0" "-ffunction-sections" "-fdata-sections" "-fPIC" "-gdwarf-2" "-fno-omit-frame-pointer" "-m64" "-arch" "x86_64" "-mmacosx-version-min=10.7" "-I" "zstd/lib/" "-I" "zstd/lib/common" "-I" "zstd/lib/legacy" "-fvisibility=hidden" "-DZSTD_LIB_DEPRECATED=0" "-DXXH_PRIVATE_API=" "-DZSTDLIB_VISIBILITY=" "-DZDICTLIB_VISIBILITY=" "-DZSTDERRORLIB_VISIBILITY=" "-DZSTD_LEGACY_SUPPORT=1" "-o" "/opt/rustwide/target/x86_64-apple-darwin/debug/build/zstd-sys-d331e80d5a56560e/out/8957a4c8b028b07b-debug.o" "-c" "zstd/lib/common/debug.c" with args cc did not execute successfully (status code exit status: 1).cargo:warning=cc: error: unrecognized command-line option '-arch'
[INFO] [stderr]   cargo:warning=cc: error: unrecognized command-line option '-mmacosx-version-min=10.7'
[INFO] [stderr] 
[INFO] [stderr]   exit status: 1
[INFO] [stderr]   cargo:warning=ToolExecError: Command "cc" "-O0" "-ffunction-sections" "-fdata-sections" "-fPIC" "-gdwarf-2" "-fno-omit-frame-pointer" "-m64" "-arch" "x86_64" "-mmacosx-version-min=10.7" "-I" "zstd/lib/" "-I" "zstd/lib/common" "-I" "zstd/lib/legacy" "-fvisibility=hidden" "-DZSTD_LIB_DEPRECATED=0" "-DXXH_PRIVATE_API=" "-DZSTDLIB_VISIBILITY=" "-DZDICTLIB_VISIBILITY=" "-DZSTDERRORLIB_VISIBILITY=" "-DZSTD_LEGACY_SUPPORT=1" "-o" "/opt/rustwide/target/x86_64-apple-darwin/debug/build/zstd-sys-d331e80d5a56560e/out/8957a4c8b028b07b-entropy_common.o" "-c" "zstd/lib/common/entropy_common.c" with args cc did not execute successfully (status code exit status: 1).cargo:warning=cc: error: unrecognized command-line option '-arch'
[INFO] [stderr]   cargo:warning=cc: error: unrecognized command-line option '-mmacosx-version-min=10.7'
[INFO] [stderr] 
[INFO] [stderr]   exit status: 1
[INFO] [stderr]   cargo:warning=ToolExecError: Command "cc" "-O0" "-ffunction-sections" "-fdata-sections" "-fPIC" "-gdwarf-2" "-fno-omit-frame-pointer" "-m64" "-arch" "x86_64" "-mmacosx-version-min=10.7" "-I" "zstd/lib/" "-I" "zstd/lib/common" "-I" "zstd/lib/legacy" "-fvisibility=hidden" "-DZSTD_LIB_DEPRECATED=0" "-DXXH_PRIVATE_API=" "-DZSTDLIB_VISIBILITY=" "-DZDICTLIB_VISIBILITY=" "-DZSTDERRORLIB_VISIBILITY=" "-DZSTD_LEGACY_SUPPORT=1" "-o" "/opt/rustwide/target/x86_64-apple-darwin/debug/build/zstd-sys-d331e80d5a56560e/out/8957a4c8b028b07b-error_private.o" "-c" "zstd/lib/common/error_private.c" with args cc did not execute successfully (status code exit status: 1).cargo:warning=cc: error: unrecognized command-line option '-arch'
[INFO] [stderr]   cargo:warning=cc: error: unrecognized command-line option '-mmacosx-version-min=10.7'
[INFO] [stderr] 
[INFO] [stderr]   exit status: 1
[INFO] [stderr]   cargo:warning=ToolExecError: Command "cc" "-O0" "-ffunction-sections" "-fdata-sections" "-fPIC" "-gdwarf-2" "-fno-omit-frame-pointer" "-m64" "-arch" "x86_64" "-mmacosx-version-min=10.7" "-I" "zstd/lib/" "-I" "zstd/lib/common" "-I" "zstd/lib/legacy" "-fvisibility=hidden" "-DZSTD_LIB_DEPRECATED=0" "-DXXH_PRIVATE_API=" "-DZSTDLIB_VISIBILITY=" "-DZDICTLIB_VISIBILITY=" "-DZSTDERRORLIB_VISIBILITY=" "-DZSTD_LEGACY_SUPPORT=1" "-o" "/opt/rustwide/target/x86_64-apple-darwin/debug/build/zstd-sys-d331e80d5a56560e/out/8957a4c8b028b07b-fse_decompress.o" "-c" "zstd/lib/common/fse_decompress.c" with args cc did not execute successfully (status code exit status: 1).cargo:warning=cc: error: unrecognized command-line option '-arch'
[INFO] [stderr]   cargo:warning=cc: error: unrecognized command-line option '-mmacosx-version-min=10.7'
[INFO] [stderr] 
[INFO] [stderr]   exit status: 1
[INFO] [stderr]   cargo:warning=ToolExecError: Command "cc" "-O0" "-ffunction-sections" "-fdata-sections" "-fPIC" "-gdwarf-2" "-fno-omit-frame-pointer" "-m64" "-arch" "x86_64" "-mmacosx-version-min=10.7" "-I" "zstd/lib/" "-I" "zstd/lib/common" "-I" "zstd/lib/legacy" "-fvisibility=hidden" "-DZSTD_LIB_DEPRECATED=0" "-DXXH_PRIVATE_API=" "-DZSTDLIB_VISIBILITY=" "-DZDICTLIB_VISIBILITY=" "-DZSTDERRORLIB_VISIBILITY=" "-DZSTD_LEGACY_SUPPORT=1" "-o" "/opt/rustwide/target/x86_64-apple-darwin/debug/build/zstd-sys-d331e80d5a56560e/out/8957a4c8b028b07b-pool.o" "-c" "zstd/lib/common/pool.c" with args cc did not execute successfully (status code exit status: 1).cargo:warning=cc: error: unrecognized command-line option '-arch'
[INFO] [stderr]   cargo:warning=cc: error: unrecognized command-line option '-mmacosx-version-min=10.7'
[INFO] [stderr] 
[INFO] [stderr]   exit status: 1
[INFO] [stderr]   cargo:warning=ToolExecError: Command "cc" "-O0" "-ffunction-sections" "-fdata-sections" "-fPIC" "-gdwarf-2" "-fno-omit-frame-pointer" "-m64" "-arch" "x86_64" "-mmacosx-version-min=10.7" "-I" "zstd/lib/" "-I" "zstd/lib/common" "-I" "zstd/lib/legacy" "-fvisibility=hidden" "-DZSTD_LIB_DEPRECATED=0" "-DXXH_PRIVATE_API=" "-DZSTDLIB_VISIBILITY=" "-DZDICTLIB_VISIBILITY=" "-DZSTDERRORLIB_VISIBILITY=" "-DZSTD_LEGACY_SUPPORT=1" "-o" "/opt/rustwide/target/x86_64-apple-darwin/debug/build/zstd-sys-d331e80d5a56560e/out/8957a4c8b028b07b-threading.o" "-c" "zstd/lib/common/threading.c" with args cc did not execute successfully (status code exit status: 1).cargo:warning=cc: error: unrecognized command-line option '-arch'
[INFO] [stderr]   cargo:warning=cc: error: unrecognized command-line option '-mmacosx-version-min=10.7'
[INFO] [stderr] 
[INFO] [stderr]   exit status: 1
[INFO] [stderr]   cargo:warning=ToolExecError: Command "cc" "-O0" "-ffunction-sections" "-fdata-sections" "-fPIC" "-gdwarf-2" "-fno-omit-frame-pointer" "-m64" "-arch" "x86_64" "-mmacosx-version-min=10.7" "-I" "zstd/lib/" "-I" "zstd/lib/common" "-I" "zstd/lib/legacy" "-fvisibility=hidden" "-DZSTD_LIB_DEPRECATED=0" "-DXXH_PRIVATE_API=" "-DZSTDLIB_VISIBILITY=" "-DZDICTLIB_VISIBILITY=" "-DZSTDERRORLIB_VISIBILITY=" "-DZSTD_LEGACY_SUPPORT=1" "-o" "/opt/rustwide/target/x86_64-apple-darwin/debug/build/zstd-sys-d331e80d5a56560e/out/8957a4c8b028b07b-zstd_common.o" "-c" "zstd/lib/common/zstd_common.c" with args cc did not execute successfully (status code exit status: 1).cargo:warning=cc: error: unrecognized command-line option '-arch'
[INFO] [stderr]   cargo:warning=cc: error: unrecognized command-line option '-mmacosx-version-min=10.7'
[INFO] [stderr] 
[INFO] [stderr]   exit status: 1
[INFO] [stderr]   cargo:warning=ToolExecError: Command "cc" "-O0" "-ffunction-sections" "-fdata-sections" "-fPIC" "-gdwarf-2" "-fno-omit-frame-pointer" "-m64" "-arch" "x86_64" "-mmacosx-version-min=10.7" "-I" "zstd/lib/" "-I" "zstd/lib/common" "-I" "zstd/lib/legacy" "-fvisibility=hidden" "-DZSTD_LIB_DEPRECATED=0" "-DXXH_PRIVATE_API=" "-DZSTDLIB_VISIBILITY=" "-DZDICTLIB_VISIBILITY=" "-DZSTDERRORLIB_VISIBILITY=" "-DZSTD_LEGACY_SUPPORT=1" "-o" "/opt/rustwide/target/x86_64-apple-darwin/debug/build/zstd-sys-d331e80d5a56560e/out/1ddd1489cc625d97-fse_compress.o" "-c" "zstd/lib/compress/fse_compress.c" with args cc did not execute successfully (status code exit status: 1).cargo:warning=cc: error: unrecognized command-line option '-arch'
[INFO] [stderr]   cargo:warning=cc: error: unrecognized command-line option '-mmacosx-version-min=10.7'
[INFO] [stderr] 
[INFO] [stderr]   exit status: 1
[INFO] [stderr]   cargo:warning=ToolExecError: Command "cc" "-O0" "-ffunction-sections" "-fdata-sections" "-fPIC" "-gdwarf-2" "-fno-omit-frame-pointer" "-m64" "-arch" "x86_64" "-mmacosx-version-min=10.7" "-I" "zstd/lib/" "-I" "zstd/lib/common" "-I" "zstd/lib/legacy" "-fvisibility=hidden" "-DZSTD_LIB_DEPRECATED=0" "-DXXH_PRIVATE_API=" "-DZSTDLIB_VISIBILITY=" "-DZDICTLIB_VISIBILITY=" "-DZSTDERRORLIB_VISIBILITY=" "-DZSTD_LEGACY_SUPPORT=1" "-o" "/opt/rustwide/target/x86_64-apple-darwin/debug/build/zstd-sys-d331e80d5a56560e/out/1ddd1489cc625d97-hist.o" "-c" "zstd/lib/compress/hist.c" with args cc did not execute successfully (status code exit status: 1).cargo:warning=cc: error: unrecognized command-line option '-arch'
[INFO] [stderr]   cargo:warning=cc: error: unrecognized command-line option '-mmacosx-version-min=10.7'
[INFO] [stderr] 
[INFO] [stderr]   exit status: 1
[INFO] [stderr]   cargo:warning=ToolExecError: Command "cc" "-O0" "-ffunction-sections" "-fdata-sections" "-fPIC" "-gdwarf-2" "-fno-omit-frame-pointer" "-m64" "-arch" "x86_64" "-mmacosx-version-min=10.7" "-I" "zstd/lib/" "-I" "zstd/lib/common" "-I" "zstd/lib/legacy" "-fvisibility=hidden" "-DZSTD_LIB_DEPRECATED=0" "-DXXH_PRIVATE_API=" "-DZSTDLIB_VISIBILITY=" "-DZDICTLIB_VISIBILITY=" "-DZSTDERRORLIB_VISIBILITY=" "-DZSTD_LEGACY_SUPPORT=1" "-o" "/opt/rustwide/target/x86_64-apple-darwin/debug/build/zstd-sys-d331e80d5a56560e/out/1ddd1489cc625d97-huf_compress.o" "-c" "zstd/lib/compress/huf_compress.c" with args cc did not execute successfully (status code exit status: 1).cargo:warning=cc: error: unrecognized command-line option '-arch'
[INFO] [stderr]   cargo:warning=cc: error: unrecognized command-line option '-mmacosx-version-min=10.7'
[INFO] [stderr] 
[INFO] [stderr]   exit status: 1
[INFO] [stderr]   cargo:warning=ToolExecError: Command "cc" "-O0" "-ffunction-sections" "-fdata-sections" "-fPIC" "-gdwarf-2" "-fno-omit-frame-pointer" "-m64" "-arch" "x86_64" "-mmacosx-version-min=10.7" "-I" "zstd/lib/" "-I" "zstd/lib/common" "-I" "zstd/lib/legacy" "-fvisibility=hidden" "-DZSTD_LIB_DEPRECATED=0" "-DXXH_PRIVATE_API=" "-DZSTDLIB_VISIBILITY=" "-DZDICTLIB_VISIBILITY=" "-DZSTDERRORLIB_VISIBILITY=" "-DZSTD_LEGACY_SUPPORT=1" "-o" "/opt/rustwide/target/x86_64-apple-darwin/debug/build/zstd-sys-d331e80d5a56560e/out/1ddd1489cc625d97-zstd_compress.o" "-c" "zstd/lib/compress/zstd_compress.c" with args cc did not execute successfully (status code exit status: 1).cargo:warning=cc: error: unrecognized command-line option '-arch'
[INFO] [stderr]   cargo:warning=cc: error: unrecognized command-line option '-mmacosx-version-min=10.7'
[INFO] [stderr] 
[INFO] [stderr]   exit status: 1
[INFO] [stderr]   cargo:warning=ToolExecError: Command "cc" "-O0" "-ffunction-sections" "-fdata-sections" "-fPIC" "-gdwarf-2" "-fno-omit-frame-pointer" "-m64" "-arch" "x86_64" "-mmacosx-version-min=10.7" "-I" "zstd/lib/" "-I" "zstd/lib/common" "-I" "zstd/lib/legacy" "-fvisibility=hidden" "-DZSTD_LIB_DEPRECATED=0" "-DXXH_PRIVATE_API=" "-DZSTDLIB_VISIBILITY=" "-DZDICTLIB_VISIBILITY=" "-DZSTDERRORLIB_VISIBILITY=" "-DZSTD_LEGACY_SUPPORT=1" "-o" "/opt/rustwide/target/x86_64-apple-darwin/debug/build/zstd-sys-d331e80d5a56560e/out/1ddd1489cc625d97-zstd_compress_literals.o" "-c" "zstd/lib/compress/zstd_compress_literals.c" with args cc did not execute successfully (status code exit status: 1).cargo:warning=cc: error: unrecognized command-line option '-arch'
[INFO] [stderr]   cargo:warning=cc: error: unrecognized command-line option '-mmacosx-version-min=10.7'
[INFO] [stderr] 
[INFO] [stderr]   exit status: 1
[INFO] [stderr]   cargo:warning=ToolExecError: Command "cc" "-O0" "-ffunction-sections" "-fdata-sections" "-fPIC" "-gdwarf-2" "-fno-omit-frame-pointer" "-m64" "-arch" "x86_64" "-mmacosx-version-min=10.7" "-I" "zstd/lib/" "-I" "zstd/lib/common" "-I" "zstd/lib/legacy" "-fvisibility=hidden" "-DZSTD_LIB_DEPRECATED=0" "-DXXH_PRIVATE_API=" "-DZSTDLIB_VISIBILITY=" "-DZDICTLIB_VISIBILITY=" "-DZSTDERRORLIB_VISIBILITY=" "-DZSTD_LEGACY_SUPPORT=1" "-o" "/opt/rustwide/target/x86_64-apple-darwin/debug/build/zstd-sys-d331e80d5a56560e/out/1ddd1489cc625d97-zstd_compress_sequences.o" "-c" "zstd/lib/compress/zstd_compress_sequences.c" with args cc did not execute successfully (status code exit status: 1).cargo:warning=cc: error: unrecognized command-line option '-arch'
[INFO] [stderr]   cargo:warning=cc: error: unrecognized command-line option '-mmacosx-version-min=10.7'
[INFO] [stderr] 
[INFO] [stderr]   exit status: 1
[INFO] [stderr]   cargo:warning=ToolExecError: Command "cc" "-O0" "-ffunction-sections" "-fdata-sections" "-fPIC" "-gdwarf-2" "-fno-omit-frame-pointer" "-m64" "-arch" "x86_64" "-mmacosx-version-min=10.7" "-I" "zstd/lib/" "-I" "zstd/lib/common" "-I" "zstd/lib/legacy" "-fvisibility=hidden" "-DZSTD_LIB_DEPRECATED=0" "-DXXH_PRIVATE_API=" "-DZSTDLIB_VISIBILITY=" "-DZDICTLIB_VISIBILITY=" "-DZSTDERRORLIB_VISIBILITY=" "-DZSTD_LEGACY_SUPPORT=1" "-o" "/opt/rustwide/target/x86_64-apple-darwin/debug/build/zstd-sys-d331e80d5a56560e/out/1ddd1489cc625d97-zstd_compress_superblock.o" "-c" "zstd/lib/compress/zstd_compress_superblock.c" with args cc did not execute successfully (status code exit status: 1).cargo:warning=cc: error: unrecognized command-line option '-arch'
[INFO] [stderr]   cargo:warning=cc: error: unrecognized command-line option '-mmacosx-version-min=10.7'
[INFO] [stderr] 
[INFO] [stderr]   exit status: 1
[INFO] [stderr]   cargo:warning=ToolExecError: Command "cc" "-O0" "-ffunction-sections" "-fdata-sections" "-fPIC" "-gdwarf-2" "-fno-omit-frame-pointer" "-m64" "-arch" "x86_64" "-mmacosx-version-min=10.7" "-I" "zstd/lib/" "-I" "zstd/lib/common" "-I" "zstd/lib/legacy" "-fvisibility=hidden" "-DZSTD_LIB_DEPRECATED=0" "-DXXH_PRIVATE_API=" "-DZSTDLIB_VISIBILITY=" "-DZDICTLIB_VISIBILITY=" "-DZSTDERRORLIB_VISIBILITY=" "-DZSTD_LEGACY_SUPPORT=1" "-o" "/opt/rustwide/target/x86_64-apple-darwin/debug/build/zstd-sys-d331e80d5a56560e/out/1ddd1489cc625d97-zstd_double_fast.o" "-c" "zstd/lib/compress/zstd_double_fast.c" with args cc did not execute successfully (status code exit status: 1).cargo:warning=cc: error: unrecognized command-line option '-arch'
[INFO] [stderr]   cargo:warning=cc: error: unrecognized command-line option '-mmacosx-version-min=10.7'
[INFO] [stderr] 
[INFO] [stderr]   exit status: 1
[INFO] [stderr]   cargo:warning=ToolExecError: Command "cc" "-O0" "-ffunction-sections" "-fdata-sections" "-fPIC" "-gdwarf-2" "-fno-omit-frame-pointer" "-m64" "-arch" "x86_64" "-mmacosx-version-min=10.7" "-I" "zstd/lib/" "-I" "zstd/lib/common" "-I" "zstd/lib/legacy" "-fvisibility=hidden" "-DZSTD_LIB_DEPRECATED=0" "-DXXH_PRIVATE_API=" "-DZSTDLIB_VISIBILITY=" "-DZDICTLIB_VISIBILITY=" "-DZSTDERRORLIB_VISIBILITY=" "-DZSTD_LEGACY_SUPPORT=1" "-o" "/opt/rustwide/target/x86_64-apple-darwin/debug/build/zstd-sys-d331e80d5a56560e/out/1ddd1489cc625d97-zstd_fast.o" "-c" "zstd/lib/compress/zstd_fast.c" with args cc did not execute successfully (status code exit status: 1).cargo:warning=cc: error: unrecognized command-line option '-arch'
[INFO] [stderr]   cargo:warning=cc: error: unrecognized command-line option '-mmacosx-version-min=10.7'
[INFO] [stderr] 
[INFO] [stderr]   exit status: 1
[INFO] [stderr]   cargo:warning=ToolExecError: Command "cc" "-O0" "-ffunction-sections" "-fdata-sections" "-fPIC" "-gdwarf-2" "-fno-omit-frame-pointer" "-m64" "-arch" "x86_64" "-mmacosx-version-min=10.7" "-I" "zstd/lib/" "-I" "zstd/lib/common" "-I" "zstd/lib/legacy" "-fvisibility=hidden" "-DZSTD_LIB_DEPRECATED=0" "-DXXH_PRIVATE_API=" "-DZSTDLIB_VISIBILITY=" "-DZDICTLIB_VISIBILITY=" "-DZSTDERRORLIB_VISIBILITY=" "-DZSTD_LEGACY_SUPPORT=1" "-o" "/opt/rustwide/target/x86_64-apple-darwin/debug/build/zstd-sys-d331e80d5a56560e/out/1ddd1489cc625d97-zstd_lazy.o" "-c" "zstd/lib/compress/zstd_lazy.c" with args cc did not execute successfully (status code exit status: 1).cargo:warning=cc: error: unrecognized command-line option '-arch'
[INFO] [stderr]   cargo:warning=cc: error: unrecognized command-line option '-mmacosx-version-min=10.7'
[INFO] [stderr] 
[INFO] [stderr]   exit status: 1
[INFO] [stderr]   cargo:warning=ToolExecError: Command "cc" "-O0" "-ffunction-sections" "-fdata-sections" "-fPIC" "-gdwarf-2" "-fno-omit-frame-pointer" "-m64" "-arch" "x86_64" "-mmacosx-version-min=10.7" "-I" "zstd/lib/" "-I" "zstd/lib/common" "-I" "zstd/lib/legacy" "-fvisibility=hidden" "-DZSTD_LIB_DEPRECATED=0" "-DXXH_PRIVATE_API=" "-DZSTDLIB_VISIBILITY=" "-DZDICTLIB_VISIBILITY=" "-DZSTDERRORLIB_VISIBILITY=" "-DZSTD_LEGACY_SUPPORT=1" "-o" "/opt/rustwide/target/x86_64-apple-darwin/debug/build/zstd-sys-d331e80d5a56560e/out/1ddd1489cc625d97-zstd_ldm.o" "-c" "zstd/lib/compress/zstd_ldm.c" with args cc did not execute successfully (status code exit status: 1).cargo:warning=cc: error: unrecognized command-line option '-arch'
[INFO] [stderr]   cargo:warning=cc: error: unrecognized command-line option '-mmacosx-version-min=10.7'
[INFO] [stderr] 
[INFO] [stderr]   exit status: 1
[INFO] [stderr]   cargo:warning=ToolExecError: Command "cc" "-O0" "-ffunction-sections" "-fdata-sections" "-fPIC" "-gdwarf-2" "-fno-omit-frame-pointer" "-m64" "-arch" "x86_64" "-mmacosx-version-min=10.7" "-I" "zstd/lib/" "-I" "zstd/lib/common" "-I" "zstd/lib/legacy" "-fvisibility=hidden" "-DZSTD_LIB_DEPRECATED=0" "-DXXH_PRIVATE_API=" "-DZSTDLIB_VISIBILITY=" "-DZDICTLIB_VISIBILITY=" "-DZSTDERRORLIB_VISIBILITY=" "-DZSTD_LEGACY_SUPPORT=1" "-o" "/opt/rustwide/target/x86_64-apple-darwin/debug/build/zstd-sys-d331e80d5a56560e/out/1ddd1489cc625d97-zstd_opt.o" "-c" "zstd/lib/compress/zstd_opt.c" with args cc did not execute successfully (status code exit status: 1).cargo:warning=cc: error: unrecognized command-line option '-arch'
[INFO] [stderr]   cargo:warning=cc: error: unrecognized command-line option '-mmacosx-version-min=10.7'
[INFO] [stderr] 
[INFO] [stderr]   exit status: 1
[INFO] [stderr]   cargo:warning=ToolExecError: Command "cc" "-O0" "-ffunction-sections" "-fdata-sections" "-fPIC" "-gdwarf-2" "-fno-omit-frame-pointer" "-m64" "-arch" "x86_64" "-mmacosx-version-min=10.7" "-I" "zstd/lib/" "-I" "zstd/lib/common" "-I" "zstd/lib/legacy" "-fvisibility=hidden" "-DZSTD_LIB_DEPRECATED=0" "-DXXH_PRIVATE_API=" "-DZSTDLIB_VISIBILITY=" "-DZDICTLIB_VISIBILITY=" "-DZSTDERRORLIB_VISIBILITY=" "-DZSTD_LEGACY_SUPPORT=1" "-o" "/opt/rustwide/target/x86_64-apple-darwin/debug/build/zstd-sys-d331e80d5a56560e/out/1ddd1489cc625d97-zstdmt_compress.o" "-c" "zstd/lib/compress/zstdmt_compress.c" with args cc did not execute successfully (status code exit status: 1).cargo:warning=cc: error: unrecognized command-line option '-arch'
[INFO] [stderr]   cargo:warning=cc: error: unrecognized command-line option '-mmacosx-version-min=10.7'
[INFO] [stderr] 
[INFO] [stderr]   exit status: 1
[INFO] [stderr]   cargo:warning=ToolExecError: Command "cc" "-O0" "-ffunction-sections" "-fdata-sections" "-fPIC" "-gdwarf-2" "-fno-omit-frame-pointer" "-m64" "-arch" "x86_64" "-mmacosx-version-min=10.7" "-I" "zstd/lib/" "-I" "zstd/lib/common" "-I" "zstd/lib/legacy" "-fvisibility=hidden" "-DZSTD_LIB_DEPRECATED=0" "-DXXH_PRIVATE_API=" "-DZSTDLIB_VISIBILITY=" "-DZDICTLIB_VISIBILITY=" "-DZSTDERRORLIB_VISIBILITY=" "-DZSTD_LEGACY_SUPPORT=1" "-o" "/opt/rustwide/target/x86_64-apple-darwin/debug/build/zstd-sys-d331e80d5a56560e/out/690f776bf7b37aeb-huf_decompress.o" "-c" "zstd/lib/decompress/huf_decompress.c" with args cc did not execute successfully (status code exit status: 1).cargo:warning=cc: error: unrecognized command-line option '-arch'
[INFO] [stderr]   cargo:warning=cc: error: unrecognized command-line option '-mmacosx-version-min=10.7'
[INFO] [stderr] 
[INFO] [stderr]   exit status: 1
[INFO] [stderr]   cargo:warning=ToolExecError: Command "cc" "-O0" "-ffunction-sections" "-fdata-sections" "-fPIC" "-gdwarf-2" "-fno-omit-frame-pointer" "-m64" "-arch" "x86_64" "-mmacosx-version-min=10.7" "-I" "zstd/lib/" "-I" "zstd/lib/common" "-I" "zstd/lib/legacy" "-fvisibility=hidden" "-DZSTD_LIB_DEPRECATED=0" "-DXXH_PRIVATE_API=" "-DZSTDLIB_VISIBILITY=" "-DZDICTLIB_VISIBILITY=" "-DZSTDERRORLIB_VISIBILITY=" "-DZSTD_LEGACY_SUPPORT=1" "-o" "/opt/rustwide/target/x86_64-apple-darwin/debug/build/zstd-sys-d331e80d5a56560e/out/690f776bf7b37aeb-zstd_ddict.o" "-c" "zstd/lib/decompress/zstd_ddict.c" with args cc did not execute successfully (status code exit status: 1).cargo:warning=cc: error: unrecognized command-line option '-arch'
[INFO] [stderr]   cargo:warning=cc: error: unrecognized command-line option '-mmacosx-version-min=10.7'
[INFO] [stderr] 
[INFO] [stderr]   exit status: 1
[INFO] [stderr]   cargo:warning=ToolExecError: Command "cc" "-O0" "-ffunction-sections" "-fdata-sections" "-fPIC" "-gdwarf-2" "-fno-omit-frame-pointer" "-m64" "-arch" "x86_64" "-mmacosx-version-min=10.7" "-I" "zstd/lib/" "-I" "zstd/lib/common" "-I" "zstd/lib/legacy" "-fvisibility=hidden" "-DZSTD_LIB_DEPRECATED=0" "-DXXH_PRIVATE_API=" "-DZSTDLIB_VISIBILITY=" "-DZDICTLIB_VISIBILITY=" "-DZSTDERRORLIB_VISIBILITY=" "-DZSTD_LEGACY_SUPPORT=1" "-o" "/opt/rustwide/target/x86_64-apple-darwin/debug/build/zstd-sys-d331e80d5a56560e/out/690f776bf7b37aeb-zstd_decompress.o" "-c" "zstd/lib/decompress/zstd_decompress.c" with args cc did not execute successfully (status code exit status: 1).cargo:warning=cc: error: unrecognized command-line option '-arch'
[INFO] [stderr]   cargo:warning=cc: error: unrecognized command-line option '-mmacosx-version-min=10.7'
[INFO] [stderr] 
[INFO] [stderr]   exit status: 1
[INFO] [stderr]   cargo:warning=ToolExecError: Command "cc" "-O0" "-ffunction-sections" "-fdata-sections" "-fPIC" "-gdwarf-2" "-fno-omit-frame-pointer" "-m64" "-arch" "x86_64" "-mmacosx-version-min=10.7" "-I" "zstd/lib/" "-I" "zstd/lib/common" "-I" "zstd/lib/legacy" "-fvisibility=hidden" "-DZSTD_LIB_DEPRECATED=0" "-DXXH_PRIVATE_API=" "-DZSTDLIB_VISIBILITY=" "-DZDICTLIB_VISIBILITY=" "-DZSTDERRORLIB_VISIBILITY=" "-DZSTD_LEGACY_SUPPORT=1" "-o" "/opt/rustwide/target/x86_64-apple-darwin/debug/build/zstd-sys-d331e80d5a56560e/out/690f776bf7b37aeb-zstd_decompress_block.o" "-c" "zstd/lib/decompress/zstd_decompress_block.c" with args cc did not execute successfully (status code exit status: 1).cargo:warning=cc: error: unrecognized command-line option '-arch'
[INFO] [stderr]   cargo:warning=cc: error: unrecognized command-line option '-mmacosx-version-min=10.7'
[INFO] [stderr] 
[INFO] [stderr]   exit status: 1
[INFO] [stderr]   cargo:warning=ToolExecError: Command "cc" "-O0" "-ffunction-sections" "-fdata-sections" "-fPIC" "-gdwarf-2" "-fno-omit-frame-pointer" "-m64" "-arch" "x86_64" "-mmacosx-version-min=10.7" "-I" "zstd/lib/" "-I" "zstd/lib/common" "-I" "zstd/lib/legacy" "-fvisibility=hidden" "-DZSTD_LIB_DEPRECATED=0" "-DXXH_PRIVATE_API=" "-DZSTDLIB_VISIBILITY=" "-DZDICTLIB_VISIBILITY=" "-DZSTDERRORLIB_VISIBILITY=" "-DZSTD_LEGACY_SUPPORT=1" "-o" "/opt/rustwide/target/x86_64-apple-darwin/debug/build/zstd-sys-d331e80d5a56560e/out/b0401a448be314bb-cover.o" "-c" "zstd/lib/dictBuilder/cover.c" with args cc did not execute successfully (status code exit status: 1).cargo:warning=cc: error: unrecognized command-line option '-arch'
[INFO] [stderr]   cargo:warning=cc: error: unrecognized command-line option '-mmacosx-version-min=10.7'
[INFO] [stderr] 
[INFO] [stderr]   exit status: 1
[INFO] [stderr]   cargo:warning=ToolExecError: Command "cc" "-O0" "-ffunction-sections" "-fdata-sections" "-fPIC" "-gdwarf-2" "-fno-omit-frame-pointer" "-m64" "-arch" "x86_64" "-mmacosx-version-min=10.7" "-I" "zstd/lib/" "-I" "zstd/lib/common" "-I" "zstd/lib/legacy" "-fvisibility=hidden" "-DZSTD_LIB_DEPRECATED=0" "-DXXH_PRIVATE_API=" "-DZSTDLIB_VISIBILITY=" "-DZDICTLIB_VISIBILITY=" "-DZSTDERRORLIB_VISIBILITY=" "-DZSTD_LEGACY_SUPPORT=1" "-o" "/opt/rustwide/target/x86_64-apple-darwin/debug/build/zstd-sys-d331e80d5a56560e/out/b0401a448be314bb-divsufsort.o" "-c" "zstd/lib/dictBuilder/divsufsort.c" with args cc did not execute successfully (status code exit status: 1).cargo:warning=cc: error: unrecognized command-line option '-arch'
[INFO] [stderr]   cargo:warning=cc: error: unrecognized command-line option '-mmacosx-version-min=10.7'
[INFO] [stderr] 
[INFO] [stderr]   exit status: 1
[INFO] [stderr]   cargo:warning=ToolExecError: Command "cc" "-O0" "-ffunction-sections" "-fdata-sections" "-fPIC" "-gdwarf-2" "-fno-omit-frame-pointer" "-m64" "-arch" "x86_64" "-mmacosx-version-min=10.7" "-I" "zstd/lib/" "-I" "zstd/lib/common" "-I" "zstd/lib/legacy" "-fvisibility=hidden" "-DZSTD_LIB_DEPRECATED=0" "-DXXH_PRIVATE_API=" "-DZSTDLIB_VISIBILITY=" "-DZDICTLIB_VISIBILITY=" "-DZSTDERRORLIB_VISIBILITY=" "-DZSTD_LEGACY_SUPPORT=1" "-o" "/opt/rustwide/target/x86_64-apple-darwin/debug/build/zstd-sys-d331e80d5a56560e/out/b0401a448be314bb-fastcover.o" "-c" "zstd/lib/dictBuilder/fastcover.c" with args cc did not execute successfully (status code exit status: 1).cargo:warning=cc: error: unrecognized command-line option '-arch'
[INFO] [stderr]   cargo:warning=cc: error: unrecognized command-line option '-mmacosx-version-min=10.7'
[INFO] [stderr] 
[INFO] [stderr]   exit status: 1
[INFO] [stderr]   cargo:warning=ToolExecError: Command "cc" "-O0" "-ffunction-sections" "-fdata-sections" "-fPIC" "-gdwarf-2" "-fno-omit-frame-pointer" "-m64" "-arch" "x86_64" "-mmacosx-version-min=10.7" "-I" "zstd/lib/" "-I" "zstd/lib/common" "-I" "zstd/lib/legacy" "-fvisibility=hidden" "-DZSTD_LIB_DEPRECATED=0" "-DXXH_PRIVATE_API=" "-DZSTDLIB_VISIBILITY=" "-DZDICTLIB_VISIBILITY=" "-DZSTDERRORLIB_VISIBILITY=" "-DZSTD_LEGACY_SUPPORT=1" "-o" "/opt/rustwide/target/x86_64-apple-darwin/debug/build/zstd-sys-d331e80d5a56560e/out/b0401a448be314bb-zdict.o" "-c" "zstd/lib/dictBuilder/zdict.c" with args cc did not execute successfully (status code exit status: 1).cargo:warning=cc: error: unrecognized command-line option '-arch'
[INFO] [stderr]   cargo:warning=cc: error: unrecognized command-line option '-mmacosx-version-min=10.7'
[INFO] [stderr] 
[INFO] [stderr]   exit status: 1
[INFO] [stderr]   cargo:warning=ToolExecError: Command "cc" "-O0" "-ffunction-sections" "-fdata-sections" "-fPIC" "-gdwarf-2" "-fno-omit-frame-pointer" "-m64" "-arch" "x86_64" "-mmacosx-version-min=10.7" "-I" "zstd/lib/" "-I" "zstd/lib/common" "-I" "zstd/lib/legacy" "-fvisibility=hidden" "-DZSTD_LIB_DEPRECATED=0" "-DXXH_PRIVATE_API=" "-DZSTDLIB_VISIBILITY=" "-DZDICTLIB_VISIBILITY=" "-DZSTDERRORLIB_VISIBILITY=" "-DZSTD_LEGACY_SUPPORT=1" "-o" "/opt/rustwide/target/x86_64-apple-darwin/debug/build/zstd-sys-d331e80d5a56560e/out/5eeec2f4c1e9b3b6-zstd_v01.o" "-c" "zstd/lib/legacy/zstd_v01.c" with args cc did not execute successfully (status code exit status: 1).cargo:warning=cc: error: unrecognized command-line option '-arch'
[INFO] [stderr]   cargo:warning=cc: error: unrecognized command-line option '-mmacosx-version-min=10.7'
[INFO] [stderr] 
[INFO] [stderr]   exit status: 1
[INFO] [stderr]   cargo:warning=ToolExecError: Command "cc" "-O0" "-ffunction-sections" "-fdata-sections" "-fPIC" "-gdwarf-2" "-fno-omit-frame-pointer" "-m64" "-arch" "x86_64" "-mmacosx-version-min=10.7" "-I" "zstd/lib/" "-I" "zstd/lib/common" "-I" "zstd/lib/legacy" "-fvisibility=hidden" "-DZSTD_LIB_DEPRECATED=0" "-DXXH_PRIVATE_API=" "-DZSTDLIB_VISIBILITY=" "-DZDICTLIB_VISIBILITY=" "-DZSTDERRORLIB_VISIBILITY=" "-DZSTD_LEGACY_SUPPORT=1" "-o" "/opt/rustwide/target/x86_64-apple-darwin/debug/build/zstd-sys-d331e80d5a56560e/out/5eeec2f4c1e9b3b6-zstd_v02.o" "-c" "zstd/lib/legacy/zstd_v02.c" with args cc did not execute successfully (status code exit status: 1).cargo:warning=cc: error: unrecognized command-line option '-arch'
[INFO] [stderr]   cargo:warning=cc: error: unrecognized command-line option '-mmacosx-version-min=10.7'
[INFO] [stderr] 
[INFO] [stderr]   exit status: 1
[INFO] [stderr]   cargo:warning=ToolExecError: Command "cc" "-O0" "-ffunction-sections" "-fdata-sections" "-fPIC" "-gdwarf-2" "-fno-omit-frame-pointer" "-m64" "-arch" "x86_64" "-mmacosx-version-min=10.7" "-I" "zstd/lib/" "-I" "zstd/lib/common" "-I" "zstd/lib/legacy" "-fvisibility=hidden" "-DZSTD_LIB_DEPRECATED=0" "-DXXH_PRIVATE_API=" "-DZSTDLIB_VISIBILITY=" "-DZDICTLIB_VISIBILITY=" "-DZSTDERRORLIB_VISIBILITY=" "-DZSTD_LEGACY_SUPPORT=1" "-o" "/opt/rustwide/target/x86_64-apple-darwin/debug/build/zstd-sys-d331e80d5a56560e/out/5eeec2f4c1e9b3b6-zstd_v03.o" "-c" "zstd/lib/legacy/zstd_v03.c" with args cc did not execute successfully (status code exit status: 1).cargo:warning=cc: error: unrecognized command-line option '-arch'
[INFO] [stderr]   cargo:warning=cc: error: unrecognized command-line option '-mmacosx-version-min=10.7'
[INFO] [stderr] 
[INFO] [stderr]   exit status: 1
[INFO] [stderr]   cargo:warning=ToolExecError: Command "cc" "-O0" "-ffunction-sections" "-fdata-sections" "-fPIC" "-gdwarf-2" "-fno-omit-frame-pointer" "-m64" "-arch" "x86_64" "-mmacosx-version-min=10.7" "-I" "zstd/lib/" "-I" "zstd/lib/common" "-I" "zstd/lib/legacy" "-fvisibility=hidden" "-DZSTD_LIB_DEPRECATED=0" "-DXXH_PRIVATE_API=" "-DZSTDLIB_VISIBILITY=" "-DZDICTLIB_VISIBILITY=" "-DZSTDERRORLIB_VISIBILITY=" "-DZSTD_LEGACY_SUPPORT=1" "-o" "/opt/rustwide/target/x86_64-apple-darwin/debug/build/zstd-sys-d331e80d5a56560e/out/5eeec2f4c1e9b3b6-zstd_v04.o" "-c" "zstd/lib/legacy/zstd_v04.c" with args cc did not execute successfully (status code exit status: 1).cargo:warning=cc: error: unrecognized command-line option '-arch'
[INFO] [stderr]   cargo:warning=cc: error: unrecognized command-line option '-mmacosx-version-min=10.7'
[INFO] [stderr] 
[INFO] [stderr]   exit status: 1
[INFO] [stderr]   cargo:warning=ToolExecError: Command "cc" "-O0" "-ffunction-sections" "-fdata-sections" "-fPIC" "-gdwarf-2" "-fno-omit-frame-pointer" "-m64" "-arch" "x86_64" "-mmacosx-version-min=10.7" "-I" "zstd/lib/" "-I" "zstd/lib/common" "-I" "zstd/lib/legacy" "-fvisibility=hidden" "-DZSTD_LIB_DEPRECATED=0" "-DXXH_PRIVATE_API=" "-DZSTDLIB_VISIBILITY=" "-DZDICTLIB_VISIBILITY=" "-DZSTDERRORLIB_VISIBILITY=" "-DZSTD_LEGACY_SUPPORT=1" "-o" "/opt/rustwide/target/x86_64-apple-darwin/debug/build/zstd-sys-d331e80d5a56560e/out/5eeec2f4c1e9b3b6-zstd_v05.o" "-c" "zstd/lib/legacy/zstd_v05.c" with args cc did not execute successfully (status code exit status: 1).cargo:warning=cc: error: unrecognized command-line option '-arch'
[INFO] [stderr]   cargo:warning=cc: error: unrecognized command-line option '-mmacosx-version-min=10.7'
[INFO] [stderr] 
[INFO] [stderr]   exit status: 1
[INFO] [stderr]   cargo:warning=ToolExecError: Command "cc" "-O0" "-ffunction-sections" "-fdata-sections" "-fPIC" "-gdwarf-2" "-fno-omit-frame-pointer" "-m64" "-arch" "x86_64" "-mmacosx-version-min=10.7" "-I" "zstd/lib/" "-I" "zstd/lib/common" "-I" "zstd/lib/legacy" "-fvisibility=hidden" "-DZSTD_LIB_DEPRECATED=0" "-DXXH_PRIVATE_API=" "-DZSTDLIB_VISIBILITY=" "-DZDICTLIB_VISIBILITY=" "-DZSTDERRORLIB_VISIBILITY=" "-DZSTD_LEGACY_SUPPORT=1" "-o" "/opt/rustwide/target/x86_64-apple-darwin/debug/build/zstd-sys-d331e80d5a56560e/out/5eeec2f4c1e9b3b6-zstd_v06.o" "-c" "zstd/lib/legacy/zstd_v06.c" with args cc did not execute successfully (status code exit status: 1).cargo:warning=cc: error: unrecognized command-line option '-arch'
[INFO] [stderr]   cargo:warning=cc: error: unrecognized command-line option '-mmacosx-version-min=10.7'
[INFO] [stderr] 
[INFO] [stderr]   exit status: 1
[INFO] [stderr]   cargo:warning=ToolExecError: Command "cc" "-O0" "-ffunction-sections" "-fdata-sections" "-fPIC" "-gdwarf-2" "-fno-omit-frame-pointer" "-m64" "-arch" "x86_64" "-mmacosx-version-min=10.7" "-I" "zstd/lib/" "-I" "zstd/lib/common" "-I" "zstd/lib/legacy" "-fvisibility=hidden" "-DZSTD_LIB_DEPRECATED=0" "-DXXH_PRIVATE_API=" "-DZSTDLIB_VISIBILITY=" "-DZDICTLIB_VISIBILITY=" "-DZSTDERRORLIB_VISIBILITY=" "-DZSTD_LEGACY_SUPPORT=1" "-o" "/opt/rustwide/target/x86_64-apple-darwin/debug/build/zstd-sys-d331e80d5a56560e/out/5eeec2f4c1e9b3b6-zstd_v07.o" "-c" "zstd/lib/legacy/zstd_v07.c" with args cc did not execute successfully (status code exit status: 1).cargo:warning=cc: error: unrecognized command-line option '-arch'
[INFO] [stderr]   cargo:warning=cc: error: unrecognized command-line option '-mmacosx-version-min=10.7'
[INFO] [stderr] 
[INFO] [stderr]   exit status: 1
[INFO] [stderr]   cargo:warning=ToolExecError: Command "cc" "-O0" "-ffunction-sections" "-fdata-sections" "-fPIC" "-gdwarf-2" "-fno-omit-frame-pointer" "-m64" "-arch" "x86_64" "-mmacosx-version-min=10.7" "-I" "zstd/lib/" "-I" "zstd/lib/common" "-I" "zstd/lib/legacy" "-fvisibility=hidden" "-DZSTD_LIB_DEPRECATED=0" "-DXXH_PRIVATE_API=" "-DZSTDLIB_VISIBILITY=" "-DZDICTLIB_VISIBILITY=" "-DZSTDERRORLIB_VISIBILITY=" "-DZSTD_LEGACY_SUPPORT=1" "-o" "/opt/rustwide/target/x86_64-apple-darwin/debug/build/zstd-sys-d331e80d5a56560e/out/690f776bf7b37aeb-huf_decompress_amd64.o" "-c" "zstd/lib/decompress/huf_decompress_amd64.S" with args cc did not execute successfully (status code exit status: 1).
[INFO] [stderr] 
[INFO] [stderr]   --- stderr
[INFO] [stderr] 
[INFO] [stderr] 
[INFO] [stderr]   error occurred: Command "cc" "-O0" "-ffunction-sections" "-fdata-sections" "-fPIC" "-gdwarf-2" "-fno-omit-frame-pointer" "-m64" "-arch" "x86_64" "-mmacosx-version-min=10.7" "-I" "zstd/lib/" "-I" "zstd/lib/common" "-I" "zstd/lib/legacy" "-fvisibility=hidden" "-DZSTD_LIB_DEPRECATED=0" "-DXXH_PRIVATE_API=" "-DZSTDLIB_VISIBILITY=" "-DZDICTLIB_VISIBILITY=" "-DZSTDERRORLIB_VISIBILITY=" "-DZSTD_LEGACY_SUPPORT=1" "-o" "/opt/rustwide/target/x86_64-apple-darwin/debug/build/zstd-sys-d331e80d5a56560e/out/690f776bf7b37aeb-huf_decompress_amd64.o" "-c" "zstd/lib/decompress/huf_decompress_amd64.S" with args cc did not execute successfully (status code exit status: 1).
[INFO] [stderr] 
[INFO] [stderr] 
[INFO] [stderr] warning: build failed, waiting for other jobs to finish...
[INFO] running `Command { std: "docker" "inspect" "e5059285da04a56c30da9d7442f7ca0905b5538475d9bad6e90a7b5c8cba5228", kill_on_drop: false }`
[INFO] running `Command { std: "docker" "rm" "-f" "e5059285da04a56c30da9d7442f7ca0905b5538475d9bad6e90a7b5c8cba5228", kill_on_drop: false }`
[INFO] [stdout] e5059285da04a56c30da9d7442f7ca0905b5538475d9bad6e90a7b5c8cba5228