wasmer-journal 0.19.0

Journaling functionality used by Wasmer to save and restore WASM state
Documentation
Build #1775721 2025-02-18T17:32:14.205380+00:00
# rustc version
rustc 1.87.0-nightly (ce36a966c 2025-02-17)# docs.rs version
docsrs 0.6.0 (35977596 2025-02-09)# build log
[INFO] running `Command { std: "docker" "create" "-v" "/home/cratesfyi/workspace/builds/wasmer-journal-0.19.0/target:/opt/rustwide/target:rw,Z" "-v" "/home/cratesfyi/workspace/builds/wasmer-journal-0.19.0/source:/opt/rustwide/workdir:ro,Z" "-v" "/home/cratesfyi/workspace/cargo-home:/opt/rustwide/cargo-home:ro,Z" "-v" "/home/cratesfyi/workspace/rustup-home:/opt/rustwide/rustup-home:ro,Z" "-e" "SOURCE_DIR=/opt/rustwide/workdir" "-e" "CARGO_TARGET_DIR=/opt/rustwide/target" "-e" "DOCS_RS=1" "-e" "CARGO_HOME=/opt/rustwide/cargo-home" "-e" "RUSTUP_HOME=/opt/rustwide/rustup-home" "-w" "/opt/rustwide/workdir" "-m" "6442450944" "--cpus" "6" "--user" "1001:1001" "--network" "none" "ghcr.io/rust-lang/crates-build-env/linux@sha256:3959728d45483eb673ba100a951a6b9f5012970368db2a9e08e0ac9b67c8a5ad" "/opt/rustwide/cargo-home/bin/cargo" "+nightly" "rustdoc" "--lib" "-Zrustdoc-map" "--config" "build.rustdocflags=[\"--cfg\", \"docsrs\", \"-Z\", \"unstable-options\", \"--emit=invocation-specific\", \"--resource-suffix\", \"-20250217-1.87.0-nightly-ce36a966c\", \"--static-root-path\", \"/-/rustdoc.static/\", \"--cap-lints\", \"warn\", \"--extern-html-root-takes-precedence\"]" "--offline" "-Zunstable-options" "--config=doc.extern-map.registries.crates-io=\"https://docs.rs/{pkg_name}/{version}/i686-unknown-linux-gnu\"" "-Zrustdoc-scrape-examples" "-j6" "--target" "i686-unknown-linux-gnu", kill_on_drop: false }`
[INFO] [stdout] 7a36ec83d376ef5656038123afafa9d0396300a7f2f081c071005c32c61081f0
[INFO] [stderr] WARNING: Your kernel does not support swap limit capabilities or the cgroup is not mounted. Memory limited without swap.
[INFO] running `Command { std: "docker" "start" "-a" "7a36ec83d376ef5656038123afafa9d0396300a7f2f081c071005c32c61081f0", kill_on_drop: false }`
[INFO] [stderr] warning: target filter specified, but no targets matched; this is a no-op
[INFO] [stderr]     Checking wasmer-vm v6.0.0-alpha.1
[INFO] [stderr]     Checking semver v1.0.25
[INFO] [stderr]     Checking xattr v1.4.0
[INFO] [stderr]     Checking regex v1.11.1
[INFO] [stderr]     Checking bytesize v1.3.2
[INFO] [stderr]     Checking console v0.15.10
[INFO] [stderr]     Checking filetime v0.2.25
[INFO] [stderr]     Checking fastrand v2.3.0
[INFO] [stderr] error[E0425]: cannot find value `UNWIND_DATA_REG` in this scope
[INFO] [stderr]    --> /opt/rustwide/cargo-home/registry/src/index.crates.io-1949cf8c6b5b557f/wasmer-vm-6.0.0-alpha.1/src/libcalls/eh/gcc.rs:129:48
[INFO] [stderr]     |
[INFO] [stderr] 129 |                     uw::_Unwind_SetGR(context, UNWIND_DATA_REG.0, uw_exc as _);
[INFO] [stderr]     |                                                ^^^^^^^^^^^^^^^ not found in this scope
[INFO] [stderr] 
[INFO] [stderr] error[E0425]: cannot find value `UNWIND_DATA_REG` in this scope
[INFO] [stderr]    --> /opt/rustwide/cargo-home/registry/src/index.crates.io-1949cf8c6b5b557f/wasmer-vm-6.0.0-alpha.1/src/libcalls/eh/gcc.rs:130:48
[INFO] [stderr]     |
[INFO] [stderr] 130 |                     uw::_Unwind_SetGR(context, UNWIND_DATA_REG.1, 0);
[INFO] [stderr]     |                                                ^^^^^^^^^^^^^^^ not found in this scope
[INFO] [stderr] 
[INFO] [stderr] error[E0425]: cannot find value `UNWIND_DATA_REG` in this scope
[INFO] [stderr]    --> /opt/rustwide/cargo-home/registry/src/index.crates.io-1949cf8c6b5b557f/wasmer-vm-6.0.0-alpha.1/src/libcalls/eh/gcc.rs:135:48
[INFO] [stderr]     |
[INFO] [stderr] 135 |                     uw::_Unwind_SetGR(context, UNWIND_DATA_REG.0, uw_exc as _);
[INFO] [stderr]     |                                                ^^^^^^^^^^^^^^^ not found in this scope
[INFO] [stderr] 
[INFO] [stderr] error[E0425]: cannot find value `UNWIND_DATA_REG` in this scope
[INFO] [stderr]    --> /opt/rustwide/cargo-home/registry/src/index.crates.io-1949cf8c6b5b557f/wasmer-vm-6.0.0-alpha.1/src/libcalls/eh/gcc.rs:137:48
[INFO] [stderr]     |
[INFO] [stderr] 137 |                     uw::_Unwind_SetGR(context, UNWIND_DATA_REG.1, tag as _);
[INFO] [stderr]     |                                                ^^^^^^^^^^^^^^^ not found in this scope
[INFO] [stderr] 
[INFO] [stderr]     Checking linked-hash-map v0.5.6
[INFO] [stderr]     Checking path-clean v1.0.1
[INFO] [stderr]     Checking similar v2.7.0
[INFO] [stderr]     Checking powerfmt v0.2.0
[INFO] [stderr]     Checking self_cell v1.1.0
[INFO] [stderr]     Checking tempfile v3.17.1
[INFO] [stderr]     Checking webc v7.1.0
[INFO] [stderr]     Checking tar v0.4.43
[INFO] [stderr]     Checking deranged v0.3.11
[INFO] [stderr]     Checking wasmer-config v0.13.0
[INFO] [stderr] For more information about this error, try `rustc --explain E0425`.
[INFO] [stderr] error: could not compile `wasmer-vm` (lib) due to 4 previous errors
[INFO] [stderr] warning: build failed, waiting for other jobs to finish...
[INFO] running `Command { std: "docker" "inspect" "7a36ec83d376ef5656038123afafa9d0396300a7f2f081c071005c32c61081f0", kill_on_drop: false }`
[INFO] running `Command { std: "docker" "rm" "-f" "7a36ec83d376ef5656038123afafa9d0396300a7f2f081c071005c32c61081f0", kill_on_drop: false }`
[INFO] [stdout] 7a36ec83d376ef5656038123afafa9d0396300a7f2f081c071005c32c61081f0